[CentOS-devel] xfs-kmod

Farkas Levente lfarkas at lfarkas.org
Wed Jul 15 22:30:34 UTC 2009


hi,
i try to rebuild kmod-xfs, but none of the centosplus and extras
xfs-kmod-0.4-2.src.rpm are rebuild. i try on x86_64 but i've got these
errors on i386 not even start to build (may be my fault?) while on
x86_64 bellow.
is there any plan to fix it?
------------------------------------------------
Executing(%build): /bin/sh -e /var/tmp/rpm-tmp.7636
+ umask 022
+ cd /home/robot/rpm/BUILD
+ cd xfs-kmod-0.4
+ LANG=C
+ export LANG
+ unset DISPLAY
+ for kvariant in '""'
+ ksrc=/usr/src/kernels/2.6.18-128.1.16.el5-x86_64
+ cd _kmod_build_
+ make TOPDIR=/usr/src/kernels/2.6.18-128.1.16.el5-x86_64 modules -j4
make -C /usr/src/kernels/2.6.18-128.1.16.el5-x86_64 OOT_BUILD=y
SUBDIRS=/home/robot/rpm/BUILD/xfs-kmod-0.4/_kmod_build_ modules
make[1]: Entering directory `/usr/src/kernels/2.6.18-128.1.16.el5-x86_64'
  CC [M]  /home/robot/rpm/BUILD/xfs-kmod-0.4/_kmod_build_/quota/xfs_dquot.o
  CC [M]
/home/robot/rpm/BUILD/xfs-kmod-0.4/_kmod_build_/quota/xfs_dquot_item.o
  CC [M]
/home/robot/rpm/BUILD/xfs-kmod-0.4/_kmod_build_/quota/xfs_trans_dquot.o
In file included from
/home/robot/rpm/BUILD/xfs-kmod-0.4/_kmod_build_/xfs.h:21,
                 from
/home/robot/rpm/BUILD/xfs-kmod-0.4/_kmod_build_/quota/xfs_dquot.c:19:
/home/robot/rpm/BUILD/xfs-kmod-0.4/_kmod_build_/linux-2.6/xfs_linux.h:120:
error: redefinition of 'set_buffer_unwritten'
include/linux/buffer_head.h:126: error: previous definition of
'set_buffer_unwritten' was here
/home/robot/rpm/BUILD/xfs-kmod-0.4/_kmod_build_/linux-2.6/xfs_linux.h:120:
error: redefinition of 'clear_buffer_unwritten'
include/linux/buffer_head.h:126: error: previous definition of
'clear_buffer_unwritten' was here
/home/robot/rpm/BUILD/xfs-kmod-0.4/_kmod_build_/linux-2.6/xfs_linux.h:120:
error: redefinition of 'buffer_unwritten'
include/linux/buffer_head.h:126: error: previous definition of
'buffer_unwritten' was here
make[2]: ***
[/home/robot/rpm/BUILD/xfs-kmod-0.4/_kmod_build_/quota/xfs_dquot.o] Error 1
make[2]: *** Waiting for unfinished jobs....
In file included from
/home/robot/rpm/BUILD/xfs-kmod-0.4/_kmod_build_/xfs.h:21,
                 from
/home/robot/rpm/BUILD/xfs-kmod-0.4/_kmod_build_/quota/xfs_dquot_item.c:19:
/home/robot/rpm/BUILD/xfs-kmod-0.4/_kmod_build_/linux-2.6/xfs_linux.h:120:
error: redefinition of 'set_buffer_unwritten'
include/linux/buffer_head.h:126: error: previous definition of
'set_buffer_unwritten' was here
/home/robot/rpm/BUILD/xfs-kmod-0.4/_kmod_build_/linux-2.6/xfs_linux.h:120:
error: redefinition of 'clear_buffer_unwritten'
include/linux/buffer_head.h:126: error: previous definition of
'clear_buffer_unwritten' was here
/home/robot/rpm/BUILD/xfs-kmod-0.4/_kmod_build_/linux-2.6/xfs_linux.h:120:
error: redefinition of 'buffer_unwritten'
include/linux/buffer_head.h:126: error: previous definition of
'buffer_unwritten' was here
make[2]: ***
[/home/robot/rpm/BUILD/xfs-kmod-0.4/_kmod_build_/quota/xfs_dquot_item.o]
Error 1
In file included from
/home/robot/rpm/BUILD/xfs-kmod-0.4/_kmod_build_/xfs.h:21,
                 from
/home/robot/rpm/BUILD/xfs-kmod-0.4/_kmod_build_/quota/xfs_trans_dquot.c:19:
/home/robot/rpm/BUILD/xfs-kmod-0.4/_kmod_build_/linux-2.6/xfs_linux.h:120:
error: redefinition of 'set_buffer_unwritten'
include/linux/buffer_head.h:126: error: previous definition of
'set_buffer_unwritten' was here
/home/robot/rpm/BUILD/xfs-kmod-0.4/_kmod_build_/linux-2.6/xfs_linux.h:120:
error: redefinition of 'clear_buffer_unwritten'
include/linux/buffer_head.h:126: error: previous definition of
'clear_buffer_unwritten' was here
/home/robot/rpm/BUILD/xfs-kmod-0.4/_kmod_build_/linux-2.6/xfs_linux.h:120:
error: redefinition of 'buffer_unwritten'
include/linux/buffer_head.h:126: error: previous definition of
'buffer_unwritten' was here
make[2]: ***
[/home/robot/rpm/BUILD/xfs-kmod-0.4/_kmod_build_/quota/xfs_trans_dquot.o]
Error 1
make[2]: *** wait: No child processes.  Stop.
make[1]: *** [_module_/home/robot/rpm/BUILD/xfs-kmod-0.4/_kmod_build_]
Error 2
make[1]: Leaving directory `/usr/src/kernels/2.6.18-128.1.16.el5-x86_64'
make: *** [modules] Error 2
error: Bad exit status from /var/tmp/rpm-tmp.7636 (%build)
------------------------------------------------



-- 
  Levente                               "Si vis pacem para bellum!"



More information about the CentOS-devel mailing list