[CentOS-build-reports] Build Fail: hping3 0.0.20051105-22.el7.aarch64 on c7-epel.a64

buildsys at centos.org buildsys at centos.org
Wed Jun 15 01:10:27 UTC 2016


ROOT log: -----------------( last 500 lines )-----\n\n
DEBUG util.py:393:   libgomp                aarch64 4.8.5-4.el7                c7.1511.00.a64 128 k
DEBUG util.py:393:   libgpg-error           aarch64 1.12-3.el7                 c7.1511.00.a64  87 k
DEBUG util.py:393:   libidn                 aarch64 1.28-4.el7                 c7.1511.00.a64 208 k
DEBUG util.py:393:   libmount               aarch64 2.23.2-26.el7_2.2          c7.1511.u.a64  159 k
DEBUG util.py:393:   libmpc                 aarch64 1.0.1-3.el7                c7.1511.00.a64  49 k
DEBUG util.py:393:   libpwquality           aarch64 1.2.3-4.el7                c7.1511.00.a64  84 k
DEBUG util.py:393:   libselinux             aarch64 2.2.2-6.el7                c7.1511.00.a64 141 k
DEBUG util.py:393:   libsemanage            aarch64 2.1.10-18.el7              c7.1511.00.a64 117 k
DEBUG util.py:393:   libsepol               aarch64 2.1.9-3.el7                c7.1511.00.a64 140 k
DEBUG util.py:393:   libssh2                aarch64 1.4.3-10.el7_2.1           c7.1511.00.a64 128 k
DEBUG util.py:393:   libstdc++              aarch64 4.8.5-4.el7                c7.1511.00.a64 281 k
DEBUG util.py:393:   libstdc++-devel        aarch64 4.8.5-4.el7                c7.1511.00.a64 1.5 M
DEBUG util.py:393:   libtasn1               aarch64 3.8-2.el7                  c7.1511.00.a64 316 k
DEBUG util.py:393:   libuser                aarch64 0.60-7.el7                 c7.1511.00.a64 395 k
DEBUG util.py:393:   libutempter            aarch64 1.1.6-4.el7                c7.1511.00.a64  25 k
DEBUG util.py:393:   libuuid                aarch64 2.23.2-26.el7_2.2          c7.1511.u.a64   73 k
DEBUG util.py:393:   libverto               aarch64 0.2.5-4.el7                c7.1511.00.a64  16 k
DEBUG util.py:393:   libxml2                aarch64 2.9.1-6.el7.2              c7.1511.00.a64 598 k
DEBUG util.py:393:   lua                    aarch64 5.1.4-14.el7               c7.1511.00.a64 190 k
DEBUG util.py:393:   mpfr                   aarch64 3.1.1-4.el7                c7.1511.00.a64 198 k
DEBUG util.py:393:   ncurses                aarch64 5.9-13.20130511.el7        c7.1511.00.a64 303 k
DEBUG util.py:393:   ncurses-base           noarch  5.9-13.20130511.el7        c7.1511.00.a64  68 k
DEBUG util.py:393:   ncurses-libs           aarch64 5.9-13.20130511.el7        c7.1511.00.a64 290 k
DEBUG util.py:393:   nspr                   aarch64 4.11.0-1.el7_2             c7.1511.u.a64  116 k
DEBUG util.py:393:   nss                    aarch64 3.21.0-9.el7.centos        c7.1511.u.a64  797 k
DEBUG util.py:393:   nss-softokn            aarch64 3.16.2.3-14.2.el7.centos   c7.1511.u.a64  293 k
DEBUG util.py:393:   nss-softokn-freebl     aarch64 3.16.2.3-14.2.el7.centos   c7.1511.u.a64  192 k
DEBUG util.py:393:   nss-sysinit            aarch64 3.21.0-9.el7.centos        c7.1511.u.a64   54 k
DEBUG util.py:393:   nss-tools              aarch64 3.21.0-9.el7.centos        c7.1511.u.a64  503 k
DEBUG util.py:393:   nss-util               aarch64 3.21.0-2.2.el7_2           c7.1511.u.a64   66 k
DEBUG util.py:393:   openldap               aarch64 2.4.40-9.el7_2             c7.1511.u.a64  325 k
DEBUG util.py:393:   openssl-libs           aarch64 1:1.0.1e-51.el7.4          c7.1511.00.a64 869 k
DEBUG util.py:393:   p11-kit                aarch64 0.20.7-3.el7               c7.1511.00.a64 100 k
DEBUG util.py:393:   p11-kit-trust          aarch64 0.20.7-3.el7               c7.1511.00.a64 120 k
DEBUG util.py:393:   pam                    aarch64 1.1.8-12.el7.1             c7.1511.00.a64 709 k
DEBUG util.py:393:   pcre                   aarch64 8.32-15.el7_2.1            c7.1511.u.a64  288 k
DEBUG util.py:393:   perl                   aarch64 4:5.16.3-286.el7           c7.1511.00.a64 7.9 M
DEBUG util.py:393:   perl-Carp              noarch  1.26-244.el7               c7.1511.00.a64  19 k
DEBUG util.py:393:   perl-Encode            aarch64 2.51-7.el7                 c7.1511.00.a64 1.1 M
DEBUG util.py:393:   perl-Exporter          noarch  5.68-3.el7                 c7.1511.00.a64  28 k
DEBUG util.py:393:   perl-File-Path         noarch  2.09-2.el7                 c7.1511.00.a64  26 k
DEBUG util.py:393:   perl-File-Temp         noarch  0.23.01-3.el7              c7.1511.00.a64  56 k
DEBUG util.py:393:   perl-Filter            aarch64 1.49-3.el7                 c7.1511.00.a64  76 k
DEBUG util.py:393:   perl-Getopt-Long       noarch  2.40-2.el7                 c7.1511.00.a64  56 k
DEBUG util.py:393:   perl-HTTP-Tiny         noarch  0.033-3.el7                c7.1511.00.a64  38 k
DEBUG util.py:393:   perl-PathTools         aarch64 3.40-5.el7                 c7.1511.00.a64  82 k
DEBUG util.py:393:   perl-Pod-Escapes       noarch  1:1.04-286.el7             c7.1511.00.a64  50 k
DEBUG util.py:393:   perl-Pod-Perldoc       noarch  3.20-4.el7                 c7.1511.00.a64  87 k
DEBUG util.py:393:   perl-Pod-Simple        noarch  1:3.28-4.el7               c7.1511.00.a64 216 k
DEBUG util.py:393:   perl-Pod-Usage         noarch  1.63-3.el7                 c7.1511.00.a64  27 k
DEBUG util.py:393:   perl-Scalar-List-Utils aarch64 1.27-248.el7               c7.1511.00.a64  35 k
DEBUG util.py:393:   perl-Socket            aarch64 2.010-3.el7                c7.1511.00.a64  48 k
DEBUG util.py:393:   perl-Storable          aarch64 2.45-3.el7                 c7.1511.00.a64  73 k
DEBUG util.py:393:   perl-Text-ParseWords   noarch  3.29-4.el7                 c7.1511.00.a64  14 k
DEBUG util.py:393:   perl-Thread-Queue      noarch  3.02-2.el7                 c7.1511.00.a64  17 k
DEBUG util.py:393:   perl-Time-HiRes        aarch64 4:1.9725-3.el7             c7.1511.00.a64  45 k
DEBUG util.py:393:   perl-Time-Local        noarch  1.2300-2.el7               c7.1511.00.a64  24 k
DEBUG util.py:393:   perl-constant          noarch  1.27-2.el7                 c7.1511.00.a64  19 k
DEBUG util.py:393:   perl-libs              aarch64 4:5.16.3-286.el7           c7.1511.00.a64 617 k
DEBUG util.py:393:   perl-macros            aarch64 4:5.16.3-286.el7           c7.1511.00.a64  42 k
DEBUG util.py:393:   perl-parent            noarch  1:0.225-244.el7            c7.1511.00.a64  12 k
DEBUG util.py:393:   perl-podlators         noarch  2.5.1-3.el7                c7.1511.00.a64 112 k
DEBUG util.py:393:   perl-srpm-macros       noarch  1-8.el7                    c7.1511.00.a64 4.6 k
DEBUG util.py:393:   perl-threads           aarch64 1.87-4.el7                 c7.1511.00.a64  48 k
DEBUG util.py:393:   perl-threads-shared    aarch64 1.43-6.el7                 c7.1511.00.a64  37 k
DEBUG util.py:393:   pinentry               aarch64 0.8.1-14.el7               c7.1511.00.a64  72 k
DEBUG util.py:393:   pkgconfig              aarch64 1:0.27.1-4.el7             c7.1511.00.a64  53 k
DEBUG util.py:393:   popt                   aarch64 1.13-16.el7                c7.1511.00.a64  40 k
DEBUG util.py:393:   pth                    aarch64 2.0.7-23.el7               c7.1511.00.a64  90 k
DEBUG util.py:393:   python-libs            aarch64 2.7.5-34.el7               c7.1511.00.a64 5.5 M
DEBUG util.py:393:   readline               aarch64 6.2-9.el7                  c7.1511.00.a64 184 k
DEBUG util.py:393:   rpm                    aarch64 4.11.3-17.el7              c7.1511.00.a64 1.2 M
DEBUG util.py:393:   rpm-build-libs         aarch64 4.11.3-17.el7              c7.1511.00.a64  96 k
DEBUG util.py:393:   rpm-libs               aarch64 4.11.3-17.el7              c7.1511.00.a64 247 k
DEBUG util.py:393:   setup                  noarch  2.8.71-6.el7               c7.1511.00.a64 165 k
DEBUG util.py:393:   shared-mime-info       aarch64 1.1-9.el7                  c7.1511.00.a64 371 k
DEBUG util.py:393:   sqlite                 aarch64 3.7.17-8.el7               c7.1511.00.a64 365 k
DEBUG util.py:393:   systemd-libs           aarch64 219-19.el7.4               c7.1511.00.a64 344 k
DEBUG util.py:393:   tzdata                 noarch  2016d-1.el7                c7.1511.u.a64  438 k
DEBUG util.py:393:   ustr                   aarch64 1.0.4-16.el7               c7.1511.00.a64  87 k
DEBUG util.py:393:   xz-libs                aarch64 5.1.2-12alpha.el7          c7.1511.00.a64  97 k
DEBUG util.py:393:   zip                    aarch64 3.0-10.el7                 c7.1511.00.a64 257 k
DEBUG util.py:393:   zlib                   aarch64 1.2.7-15.el7               c7.1511.00.a64  85 k
DEBUG util.py:393:  Transaction Summary
DEBUG util.py:393:  ================================================================================
DEBUG util.py:393:  Install  24 Packages (+128 Dependent packages)
DEBUG util.py:393:  Total download size: 103 M
DEBUG util.py:393:  Installed size: 444 M
DEBUG util.py:393:  warning: /etc/hosts created as /etc/hosts.rpmnew
DEBUG util.py:393:  Installed:
DEBUG util.py:393:    bash.aarch64 0:4.2.46-19.el7                                                  
DEBUG util.py:393:    bzip2.aarch64 0:1.0.6-13.el7                                                  
DEBUG util.py:393:    centos-release.aarch64 0:7-2.1603.el7.centos.2.8.altarch                      
DEBUG util.py:393:    coreutils.aarch64 0:8.22-15.el7.1                                             
DEBUG util.py:393:    cpio.aarch64 0:2.11-24.el7                                                    
DEBUG util.py:393:    diffutils.aarch64 0:3.3-4.el7                                                 
DEBUG util.py:393:    findutils.aarch64 1:4.5.11-5.el7                                              
DEBUG util.py:393:    gawk.aarch64 0:4.0.2-4.el7                                                    
DEBUG util.py:393:    gcc.aarch64 0:4.8.5-4.el7                                                     
DEBUG util.py:393:    gcc-c++.aarch64 0:4.8.5-4.el7                                                 
DEBUG util.py:393:    grep.aarch64 0:2.20-2.el7                                                     
DEBUG util.py:393:    gzip.aarch64 0:1.5-8.el7                                                      
DEBUG util.py:393:    info.aarch64 0:5.1-4.el7                                                      
DEBUG util.py:393:    make.aarch64 1:3.82-21.el7                                                    
DEBUG util.py:393:    patch.aarch64 0:2.7.1-8.el7                                                   
DEBUG util.py:393:    redhat-rpm-config.noarch 0:9.1.0-68.1.el7.centos                              
DEBUG util.py:393:    rpm-build.aarch64 0:4.11.3-17.el7                                             
DEBUG util.py:393:    sed.aarch64 0:4.2.2-5.el7                                                     
DEBUG util.py:393:    shadow-utils.aarch64 2:4.1.5.1-18.el7                                         
DEBUG util.py:393:    tar.aarch64 2:1.26-29.el7                                                     
DEBUG util.py:393:    unzip.aarch64 0:6.0-15.el7.centos                                             
DEBUG util.py:393:    util-linux.aarch64 0:2.23.2-26.el7_2.2                                        
DEBUG util.py:393:    which.aarch64 0:2.20-7.el7                                                    
DEBUG util.py:393:    xz.aarch64 0:5.1.2-12alpha.el7                                                
DEBUG util.py:393:  Dependency Installed:
DEBUG util.py:393:    audit-libs.aarch64 0:2.4.1-5.el7                                              
DEBUG util.py:393:    basesystem.noarch 0:10.0-7.el7.centos                                         
DEBUG util.py:393:    binutils.aarch64 0:2.23.52.0.1-55.el7                                         
DEBUG util.py:393:    bzip2-libs.aarch64 0:1.0.6-13.el7                                             
DEBUG util.py:393:    ca-certificates.noarch 0:2015.2.6-70.1.el7_2                                  
DEBUG util.py:393:    chkconfig.aarch64 0:1.3.61-5.el7_2.1                                          
DEBUG util.py:393:    cpp.aarch64 0:4.8.5-4.el7                                                     
DEBUG util.py:393:    cracklib.aarch64 0:2.9.0-11.el7                                               
DEBUG util.py:393:    cracklib-dicts.aarch64 0:2.9.0-11.el7                                         
DEBUG util.py:393:    curl.aarch64 0:7.29.0-25.el7                                                  
DEBUG util.py:393:    cyrus-sasl-lib.aarch64 0:2.1.26-20.el7                                        
DEBUG util.py:393:    dwz.aarch64 0:0.11-3.el7                                                      
DEBUG util.py:393:    elfutils.aarch64 0:0.163-3.el7                                                
DEBUG util.py:393:    elfutils-libelf.aarch64 0:0.163-3.el7                                         
DEBUG util.py:393:    elfutils-libs.aarch64 0:0.163-3.el7                                           
DEBUG util.py:393:    expat.aarch64 0:2.1.0-8.el7                                                   
DEBUG util.py:393:    file.aarch64 0:5.11-31.el7                                                    
DEBUG util.py:393:    file-libs.aarch64 0:5.11-31.el7                                               
DEBUG util.py:393:    filesystem.aarch64 0:3.2-20.el7                                               
DEBUG util.py:393:    gdb.aarch64 0:7.6.1-80.el7                                                    
DEBUG util.py:393:    gdbm.aarch64 0:1.10-8.el7                                                     
DEBUG util.py:393:    glib2.aarch64 0:2.42.2-5.el7                                                  
DEBUG util.py:393:    glibc.aarch64 0:2.17-106.el7.4                                                
DEBUG util.py:393:    glibc-common.aarch64 0:2.17-106.el7.4                                         
DEBUG util.py:393:    glibc-devel.aarch64 0:2.17-106.el7.4                                          
DEBUG util.py:393:    glibc-headers.aarch64 0:2.17-106.el7.4                                        
DEBUG util.py:393:    gmp.aarch64 1:6.0.0-12.el7                                                    
DEBUG util.py:393:    gnupg2.aarch64 0:2.0.22-3.el7                                                 
DEBUG util.py:393:    groff-base.aarch64 0:1.22.2-8.el7                                             
DEBUG util.py:393:    kernel-headers.aarch64 0:4.2.0-0.28.el7.1                                     
DEBUG util.py:393:    keyutils-libs.aarch64 0:1.5.8-3.el7                                           
DEBUG util.py:393:    krb5-libs.aarch64 0:1.13.2-12.el7_2                                           
DEBUG util.py:393:    libacl.aarch64 0:2.2.51-12.el7                                                
DEBUG util.py:393:    libassuan.aarch64 0:2.1.0-3.el7                                               
DEBUG util.py:393:    libattr.aarch64 0:2.4.46-12.el7                                               
DEBUG util.py:393:    libblkid.aarch64 0:2.23.2-26.el7_2.2                                          
DEBUG util.py:393:    libcap.aarch64 0:2.22-8.el7                                                   
DEBUG util.py:393:    libcap-ng.aarch64 0:0.7.5-4.el7                                               
DEBUG util.py:393:    libcom_err.aarch64 0:1.42.9-7.el7                                             
DEBUG util.py:393:    libcurl.aarch64 0:7.29.0-25.el7                                               
DEBUG util.py:393:    libdb.aarch64 0:5.3.21-19.el7                                                 
DEBUG util.py:393:    libdb-utils.aarch64 0:5.3.21-19.el7                                           
DEBUG util.py:393:    libffi.aarch64 0:3.0.13-16.el7                                                
DEBUG util.py:393:    libgcc.aarch64 0:4.8.5-4.el7                                                  
DEBUG util.py:393:    libgcrypt.aarch64 0:1.5.3-12.el7.1                                            
DEBUG util.py:393:    libgomp.aarch64 0:4.8.5-4.el7                                                 
DEBUG util.py:393:    libgpg-error.aarch64 0:1.12-3.el7                                             
DEBUG util.py:393:    libidn.aarch64 0:1.28-4.el7                                                   
DEBUG util.py:393:    libmount.aarch64 0:2.23.2-26.el7_2.2                                          
DEBUG util.py:393:    libmpc.aarch64 0:1.0.1-3.el7                                                  
DEBUG util.py:393:    libpwquality.aarch64 0:1.2.3-4.el7                                            
DEBUG util.py:393:    libselinux.aarch64 0:2.2.2-6.el7                                              
DEBUG util.py:393:    libsemanage.aarch64 0:2.1.10-18.el7                                           
DEBUG util.py:393:    libsepol.aarch64 0:2.1.9-3.el7                                                
DEBUG util.py:393:    libssh2.aarch64 0:1.4.3-10.el7_2.1                                            
DEBUG util.py:393:    libstdc++.aarch64 0:4.8.5-4.el7                                               
DEBUG util.py:393:    libstdc++-devel.aarch64 0:4.8.5-4.el7                                         
DEBUG util.py:393:    libtasn1.aarch64 0:3.8-2.el7                                                  
DEBUG util.py:393:    libuser.aarch64 0:0.60-7.el7                                                  
DEBUG util.py:393:    libutempter.aarch64 0:1.1.6-4.el7                                             
DEBUG util.py:393:    libuuid.aarch64 0:2.23.2-26.el7_2.2                                           
DEBUG util.py:393:    libverto.aarch64 0:0.2.5-4.el7                                                
DEBUG util.py:393:    libxml2.aarch64 0:2.9.1-6.el7.2                                               
DEBUG util.py:393:    lua.aarch64 0:5.1.4-14.el7                                                    
DEBUG util.py:393:    mpfr.aarch64 0:3.1.1-4.el7                                                    
DEBUG util.py:393:    ncurses.aarch64 0:5.9-13.20130511.el7                                         
DEBUG util.py:393:    ncurses-base.noarch 0:5.9-13.20130511.el7                                     
DEBUG util.py:393:    ncurses-libs.aarch64 0:5.9-13.20130511.el7                                    
DEBUG util.py:393:    nspr.aarch64 0:4.11.0-1.el7_2                                                 
DEBUG util.py:393:    nss.aarch64 0:3.21.0-9.el7.centos                                             
DEBUG util.py:393:    nss-softokn.aarch64 0:3.16.2.3-14.2.el7.centos                                
DEBUG util.py:393:    nss-softokn-freebl.aarch64 0:3.16.2.3-14.2.el7.centos                         
DEBUG util.py:393:    nss-sysinit.aarch64 0:3.21.0-9.el7.centos                                     
DEBUG util.py:393:    nss-tools.aarch64 0:3.21.0-9.el7.centos                                       
DEBUG util.py:393:    nss-util.aarch64 0:3.21.0-2.2.el7_2                                           
DEBUG util.py:393:    openldap.aarch64 0:2.4.40-9.el7_2                                             
DEBUG util.py:393:    openssl-libs.aarch64 1:1.0.1e-51.el7.4                                        
DEBUG util.py:393:    p11-kit.aarch64 0:0.20.7-3.el7                                                
DEBUG util.py:393:    p11-kit-trust.aarch64 0:0.20.7-3.el7                                          
DEBUG util.py:393:    pam.aarch64 0:1.1.8-12.el7.1                                                  
DEBUG util.py:393:    pcre.aarch64 0:8.32-15.el7_2.1                                                
DEBUG util.py:393:    perl.aarch64 4:5.16.3-286.el7                                                 
DEBUG util.py:393:    perl-Carp.noarch 0:1.26-244.el7                                               
DEBUG util.py:393:    perl-Encode.aarch64 0:2.51-7.el7                                              
DEBUG util.py:393:    perl-Exporter.noarch 0:5.68-3.el7                                             
DEBUG util.py:393:    perl-File-Path.noarch 0:2.09-2.el7                                            
DEBUG util.py:393:    perl-File-Temp.noarch 0:0.23.01-3.el7                                         
DEBUG util.py:393:    perl-Filter.aarch64 0:1.49-3.el7                                              
DEBUG util.py:393:    perl-Getopt-Long.noarch 0:2.40-2.el7                                          
DEBUG util.py:393:    perl-HTTP-Tiny.noarch 0:0.033-3.el7                                           
DEBUG util.py:393:    perl-PathTools.aarch64 0:3.40-5.el7                                           
DEBUG util.py:393:    perl-Pod-Escapes.noarch 1:1.04-286.el7                                        
DEBUG util.py:393:    perl-Pod-Perldoc.noarch 0:3.20-4.el7                                          
DEBUG util.py:393:    perl-Pod-Simple.noarch 1:3.28-4.el7                                           
DEBUG util.py:393:    perl-Pod-Usage.noarch 0:1.63-3.el7                                            
DEBUG util.py:393:    perl-Scalar-List-Utils.aarch64 0:1.27-248.el7                                 
DEBUG util.py:393:    perl-Socket.aarch64 0:2.010-3.el7                                             
DEBUG util.py:393:    perl-Storable.aarch64 0:2.45-3.el7                                            
DEBUG util.py:393:    perl-Text-ParseWords.noarch 0:3.29-4.el7                                      
DEBUG util.py:393:    perl-Thread-Queue.noarch 0:3.02-2.el7                                         
DEBUG util.py:393:    perl-Time-HiRes.aarch64 4:1.9725-3.el7                                        
DEBUG util.py:393:    perl-Time-Local.noarch 0:1.2300-2.el7                                         
DEBUG util.py:393:    perl-constant.noarch 0:1.27-2.el7                                             
DEBUG util.py:393:    perl-libs.aarch64 4:5.16.3-286.el7                                            
DEBUG util.py:393:    perl-macros.aarch64 4:5.16.3-286.el7                                          
DEBUG util.py:393:    perl-parent.noarch 1:0.225-244.el7                                            
DEBUG util.py:393:    perl-podlators.noarch 0:2.5.1-3.el7                                           
DEBUG util.py:393:    perl-srpm-macros.noarch 0:1-8.el7                                             
DEBUG util.py:393:    perl-threads.aarch64 0:1.87-4.el7                                             
DEBUG util.py:393:    perl-threads-shared.aarch64 0:1.43-6.el7                                      
DEBUG util.py:393:    pinentry.aarch64 0:0.8.1-14.el7                                               
DEBUG util.py:393:    pkgconfig.aarch64 1:0.27.1-4.el7                                              
DEBUG util.py:393:    popt.aarch64 0:1.13-16.el7                                                    
DEBUG util.py:393:    pth.aarch64 0:2.0.7-23.el7                                                    
DEBUG util.py:393:    python-libs.aarch64 0:2.7.5-34.el7                                            
DEBUG util.py:393:    readline.aarch64 0:6.2-9.el7                                                  
DEBUG util.py:393:    rpm.aarch64 0:4.11.3-17.el7                                                   
DEBUG util.py:393:    rpm-build-libs.aarch64 0:4.11.3-17.el7                                        
DEBUG util.py:393:    rpm-libs.aarch64 0:4.11.3-17.el7                                              
DEBUG util.py:393:    setup.noarch 0:2.8.71-6.el7                                                   
DEBUG util.py:393:    shared-mime-info.aarch64 0:1.1-9.el7                                          
DEBUG util.py:393:    sqlite.aarch64 0:3.7.17-8.el7                                                 
DEBUG util.py:393:    systemd-libs.aarch64 0:219-19.el7.4                                           
DEBUG util.py:393:    tzdata.noarch 0:2016d-1.el7                                                   
DEBUG util.py:393:    ustr.aarch64 0:1.0.4-16.el7                                                   
DEBUG util.py:393:    xz-libs.aarch64 0:5.1.2-12alpha.el7                                           
DEBUG util.py:393:    zip.aarch64 0:3.0-10.el7                                                      
DEBUG util.py:393:    zlib.aarch64 0:1.2.7-15.el7                                                   
DEBUG util.py:515:  Child return code was: 0
DEBUG util.py:108:  touching file: /srv/build/7/aarch64-C/mock-root/c7-epel.a64-aarch64/root/etc/os-release
DEBUG util.py:535:  child environment: None
DEBUG util.py:468:  Executing command: ['/usr/sbin/userdel', '-r', '-f', 'mockbuild'] with env {'LANG': 'en_GB.UTF-8', 'TERM': 'vt100', 'SHELL': '/bin/bash', 'PROMPT_COMMAND': 'printf "\x1b]0;<mock-chroot>\x07<mock-chroot>"', 'PATH': '/usr/bin:/bin:/usr/sbin:/sbin', 'HOME': '/builddir', 'HOSTNAME': 'mock'} and shell False
DEBUG util.py:393:  userdel: user 'mockbuild' does not exist
DEBUG util.py:515:  Child return code was: 6
DEBUG util.py:535:  child environment: None
DEBUG util.py:468:  Executing command: ['/usr/sbin/userdel', '-r', '-f', 'mockbuild'] with env {'LANG': 'en_GB.UTF-8', 'TERM': 'vt100', 'SHELL': '/bin/bash', 'PROMPT_COMMAND': 'printf "\x1b]0;<mock-chroot>\x07<mock-chroot>"', 'PATH': '/usr/bin:/bin:/usr/sbin:/sbin', 'HOME': '/builddir', 'HOSTNAME': 'mock'} and shell False
DEBUG util.py:393:  userdel: user 'mockbuild' does not exist
DEBUG util.py:515:  Child return code was: 6
DEBUG util.py:535:  child environment: None
DEBUG util.py:468:  Executing command: ['/usr/sbin/groupdel', 'mockbuild'] with env {'LANG': 'en_GB.UTF-8', 'TERM': 'vt100', 'SHELL': '/bin/bash', 'PROMPT_COMMAND': 'printf "\x1b]0;<mock-chroot>\x07<mock-chroot>"', 'PATH': '/usr/bin:/bin:/usr/sbin:/sbin', 'HOME': '/builddir', 'HOSTNAME': 'mock'} and shell False
DEBUG util.py:393:  groupdel: group 'mockbuild' does not exist
DEBUG util.py:515:  Child return code was: 6
DEBUG util.py:535:  child environment: None
DEBUG util.py:468:  Executing command: ['/usr/sbin/groupadd', '-g', '135', 'mockbuild'] with env {'LANG': 'en_GB.UTF-8', 'TERM': 'vt100', 'SHELL': '/bin/bash', 'PROMPT_COMMAND': 'printf "\x1b]0;<mock-chroot>\x07<mock-chroot>"', 'PATH': '/usr/bin:/bin:/usr/sbin:/sbin', 'HOME': '/builddir', 'HOSTNAME': 'mock'} and shell False
DEBUG util.py:515:  Child return code was: 0
DEBUG util.py:535:  child environment: None
DEBUG util.py:468:  Executing command: /usr/sbin/useradd -o -m -u 1006 -g 135 -d /builddir -n mockbuild with env {'LANG': 'en_GB.UTF-8', 'TERM': 'vt100', 'SHELL': '/bin/bash', 'PROMPT_COMMAND': 'printf "\x1b]0;<mock-chroot>\x07<mock-chroot>"', 'PATH': '/usr/bin:/bin:/usr/sbin:/sbin', 'HOME': '/builddir', 'HOSTNAME': 'mock'} and shell True
DEBUG util.py:515:  Child return code was: 0
DEBUG util.py:96:  ensuring that dir exists: /srv/build/7/aarch64-C/mock-root/c7-epel.a64-aarch64/root/builddir/build/RPMS
DEBUG util.py:99:  creating dir: /srv/build/7/aarch64-C/mock-root/c7-epel.a64-aarch64/root/builddir/build/RPMS
DEBUG util.py:96:  ensuring that dir exists: /srv/build/7/aarch64-C/mock-root/c7-epel.a64-aarch64/root/builddir/build/SPECS
DEBUG util.py:99:  creating dir: /srv/build/7/aarch64-C/mock-root/c7-epel.a64-aarch64/root/builddir/build/SPECS
DEBUG util.py:96:  ensuring that dir exists: /srv/build/7/aarch64-C/mock-root/c7-epel.a64-aarch64/root/builddir/build/SRPMS
DEBUG util.py:99:  creating dir: /srv/build/7/aarch64-C/mock-root/c7-epel.a64-aarch64/root/builddir/build/SRPMS
DEBUG util.py:96:  ensuring that dir exists: /srv/build/7/aarch64-C/mock-root/c7-epel.a64-aarch64/root/builddir/build/SOURCES
DEBUG util.py:99:  creating dir: /srv/build/7/aarch64-C/mock-root/c7-epel.a64-aarch64/root/builddir/build/SOURCES
DEBUG util.py:96:  ensuring that dir exists: /srv/build/7/aarch64-C/mock-root/c7-epel.a64-aarch64/root/builddir/build/BUILD
DEBUG util.py:99:  creating dir: /srv/build/7/aarch64-C/mock-root/c7-epel.a64-aarch64/root/builddir/build/BUILD
DEBUG util.py:96:  ensuring that dir exists: /srv/build/7/aarch64-C/mock-root/c7-epel.a64-aarch64/root/builddir/build/BUILDROOT
DEBUG util.py:99:  creating dir: /srv/build/7/aarch64-C/mock-root/c7-epel.a64-aarch64/root/builddir/build/BUILDROOT
DEBUG util.py:96:  ensuring that dir exists: /srv/build/7/aarch64-C/mock-root/c7-epel.a64-aarch64/root/builddir/build/originals
DEBUG util.py:99:  creating dir: /srv/build/7/aarch64-C/mock-root/c7-epel.a64-aarch64/root/builddir/build/originals
DEBUG util.py:108:  touching file: /srv/build/7/aarch64-C/mock-root/c7-epel.a64-aarch64/root/.initialized
INFO backend.py:167:  Installed packages:
DEBUG util.py:535:  child environment: None
DEBUG util.py:468:  Executing command: /bin/rpm --root /srv/build/7/aarch64-C/mock-root/c7-epel.a64-aarch64/root -qa with env {'LANG': 'en_GB.UTF-8', 'TERM': 'vt100', 'SHELL': '/bin/bash', 'HOSTNAME': 'mock', 'PROMPT_COMMAND': 'printf "\x1b]0;<mock-chroot>\x07<mock-chroot>"', 'HOME': '/builddir', 'PATH': '/usr/bin:/bin:/usr/sbin:/sbin'} and shell True
DEBUG util.py:393:  ncurses-base-5.9-13.20130511.el7.noarch
DEBUG util.py:393:  centos-release-7-2.1603.el7.centos.2.8.altarch.aarch64
DEBUG util.py:393:  filesystem-3.2-20.el7.aarch64
DEBUG util.py:393:  perl-srpm-macros-1-8.el7.noarch
DEBUG util.py:393:  nss-softokn-freebl-3.16.2.3-14.2.el7.centos.aarch64
DEBUG util.py:393:  glibc-2.17-106.el7.4.aarch64
DEBUG util.py:393:  libstdc++-4.8.5-4.el7.aarch64
DEBUG util.py:393:  bash-4.2.46-19.el7.aarch64
DEBUG util.py:393:  pcre-8.32-15.el7_2.1.aarch64
DEBUG util.py:393:  zlib-1.2.7-15.el7.aarch64
DEBUG util.py:393:  bzip2-libs-1.0.6-13.el7.aarch64
DEBUG util.py:393:  libdb-5.3.21-19.el7.aarch64
DEBUG util.py:393:  elfutils-libelf-0.163-3.el7.aarch64
DEBUG util.py:393:  popt-1.13-16.el7.aarch64
DEBUG util.py:393:  libattr-2.4.46-12.el7.aarch64
DEBUG util.py:393:  libcap-2.22-8.el7.aarch64
DEBUG util.py:393:  mpfr-3.1.1-4.el7.aarch64
DEBUG util.py:393:  libffi-3.0.13-16.el7.aarch64
DEBUG util.py:393:  audit-libs-2.4.1-5.el7.aarch64
DEBUG util.py:393:  chkconfig-1.3.61-5.el7_2.1.aarch64
DEBUG util.py:393:  file-libs-5.11-31.el7.aarch64
DEBUG util.py:393:  libcom_err-1.42.9-7.el7.aarch64
DEBUG util.py:393:  p11-kit-0.20.7-3.el7.aarch64
DEBUG util.py:393:  nss-softokn-3.16.2.3-14.2.el7.centos.aarch64
DEBUG util.py:393:  findutils-4.5.11-5.el7.aarch64
DEBUG util.py:393:  gawk-4.0.2-4.el7.aarch64
DEBUG util.py:393:  gdbm-1.10-8.el7.aarch64
DEBUG util.py:393:  file-5.11-31.el7.aarch64
DEBUG util.py:393:  cpp-4.8.5-4.el7.aarch64
DEBUG util.py:393:  groff-base-1.22.2-8.el7.aarch64
DEBUG util.py:393:  perl-HTTP-Tiny-0.033-3.el7.noarch
DEBUG util.py:393:  perl-Pod-Perldoc-3.20-4.el7.noarch
DEBUG util.py:393:  perl-Text-ParseWords-3.29-4.el7.noarch
DEBUG util.py:393:  perl-Pod-Usage-1.63-3.el7.noarch
DEBUG util.py:393:  perl-Socket-2.010-3.el7.aarch64
DEBUG util.py:393:  perl-File-Path-2.09-2.el7.noarch
DEBUG util.py:393:  perl-Scalar-List-Utils-1.27-248.el7.aarch64
DEBUG util.py:393:  perl-threads-shared-1.43-6.el7.aarch64
DEBUG util.py:393:  perl-Carp-1.26-244.el7.noarch
DEBUG util.py:393:  perl-Exporter-5.68-3.el7.noarch
DEBUG util.py:393:  perl-constant-1.27-2.el7.noarch
DEBUG util.py:393:  perl-Time-Local-1.2300-2.el7.noarch
DEBUG util.py:393:  perl-Getopt-Long-2.40-2.el7.noarch
DEBUG util.py:393:  perl-Thread-Queue-3.02-2.el7.noarch
DEBUG util.py:393:  patch-2.7.1-8.el7.aarch64
DEBUG util.py:393:  libdb-utils-5.3.21-19.el7.aarch64
DEBUG util.py:393:  bzip2-1.0.6-13.el7.aarch64
DEBUG util.py:393:  unzip-6.0-15.el7.centos.aarch64
DEBUG util.py:393:  cpio-2.11-24.el7.aarch64
DEBUG util.py:393:  libgomp-4.8.5-4.el7.aarch64
DEBUG util.py:393:  glib2-2.42.2-5.el7.aarch64
DEBUG util.py:393:  shared-mime-info-1.1-9.el7.aarch64
DEBUG util.py:393:  glibc-headers-2.17-106.el7.4.aarch64
DEBUG util.py:393:  gcc-4.8.5-4.el7.aarch64
DEBUG util.py:393:  libstdc++-devel-4.8.5-4.el7.aarch64
DEBUG util.py:393:  libtasn1-3.8-2.el7.aarch64
DEBUG util.py:393:  ustr-1.0.4-16.el7.aarch64
DEBUG util.py:393:  keyutils-libs-1.5.8-3.el7.aarch64
DEBUG util.py:393:  krb5-libs-1.13.2-12.el7_2.aarch64
DEBUG util.py:393:  coreutils-8.22-15.el7.1.aarch64
DEBUG util.py:393:  gzip-1.5-8.el7.aarch64
DEBUG util.py:393:  cracklib-dicts-2.9.0-11.el7.aarch64
DEBUG util.py:393:  libmount-2.23.2-26.el7_2.2.aarch64
DEBUG util.py:393:  pam-1.1.8-12.el7.1.aarch64
DEBUG util.py:393:  python-libs-2.7.5-34.el7.aarch64
DEBUG util.py:393:  shadow-utils-4.1.5.1-18.el7.aarch64
DEBUG util.py:393:  nss-3.21.0-9.el7.centos.aarch64
DEBUG util.py:393:  nss-tools-3.21.0-9.el7.centos.aarch64
DEBUG util.py:393:  libcurl-7.29.0-25.el7.aarch64
DEBUG util.py:393:  rpm-libs-4.11.3-17.el7.aarch64
DEBUG util.py:393:  openldap-2.4.40-9.el7_2.aarch64
DEBUG util.py:393:  rpm-build-libs-4.11.3-17.el7.aarch64
DEBUG util.py:393:  redhat-rpm-config-9.1.0-68.1.el7.centos.noarch
DEBUG util.py:393:  util-linux-2.23.2-26.el7_2.2.aarch64
DEBUG util.py:393:  gcc-c++-4.8.5-4.el7.aarch64
DEBUG util.py:393:  make-3.82-21.el7.aarch64
DEBUG util.py:393:  libgcc-4.8.5-4.el7.aarch64
DEBUG util.py:393:  kernel-headers-4.2.0-0.28.el7.1.aarch64
DEBUG util.py:393:  setup-2.8.71-6.el7.noarch
DEBUG util.py:393:  basesystem-10.0-7.el7.centos.noarch
DEBUG util.py:393:  tzdata-2016d-1.el7.noarch
DEBUG util.py:393:  glibc-common-2.17-106.el7.4.aarch64
DEBUG util.py:393:  xz-libs-5.1.2-12alpha.el7.aarch64
DEBUG util.py:393:  ncurses-libs-5.9-13.20130511.el7.aarch64
DEBUG util.py:393:  libsepol-2.1.9-3.el7.aarch64
DEBUG util.py:393:  libselinux-2.2.2-6.el7.aarch64
DEBUG util.py:393:  info-5.1-4.el7.aarch64
DEBUG util.py:393:  nspr-4.11.0-1.el7_2.aarch64
DEBUG util.py:393:  nss-util-3.21.0-2.2.el7_2.aarch64
DEBUG util.py:393:  gmp-6.0.0-12.el7.aarch64
DEBUG util.py:393:  readline-6.2-9.el7.aarch64
DEBUG util.py:393:  libacl-2.2.51-12.el7.aarch64
DEBUG util.py:393:  lua-5.1.4-14.el7.aarch64
DEBUG util.py:393:  sed-4.2.2-5.el7.aarch64
DEBUG util.py:393:  libgpg-error-1.12-3.el7.aarch64
DEBUG util.py:393:  libmpc-1.0.1-3.el7.aarch64
DEBUG util.py:393:  grep-2.20-2.el7.aarch64
DEBUG util.py:393:  libuuid-2.23.2-26.el7_2.2.aarch64
DEBUG util.py:393:  libgcrypt-1.5.3-12.el7.1.aarch64
DEBUG util.py:393:  sqlite-3.7.17-8.el7.aarch64
DEBUG util.py:393:  elfutils-libs-0.163-3.el7.aarch64
DEBUG util.py:393:  binutils-2.23.52.0.1-55.el7.aarch64
DEBUG util.py:393:  expat-2.1.0-8.el7.aarch64
DEBUG util.py:393:  elfutils-0.163-3.el7.aarch64
DEBUG util.py:393:  pinentry-0.8.1-14.el7.aarch64
DEBUG util.py:393:  libassuan-2.1.0-3.el7.aarch64
DEBUG util.py:393:  perl-parent-0.225-244.el7.noarch
DEBUG util.py:393:  perl-podlators-2.5.1-3.el7.noarch
DEBUG util.py:393:  perl-Pod-Escapes-1.04-286.el7.noarch
DEBUG util.py:393:  perl-Encode-2.51-7.el7.aarch64
DEBUG util.py:393:  perl-macros-5.16.3-286.el7.aarch64
DEBUG util.py:393:  perl-Storable-2.45-3.el7.aarch64
DEBUG util.py:393:  perl-PathTools-3.40-5.el7.aarch64
DEBUG util.py:393:  perl-Time-HiRes-1.9725-3.el7.aarch64
DEBUG util.py:393:  perl-threads-1.87-4.el7.aarch64
DEBUG util.py:393:  perl-Filter-1.49-3.el7.aarch64
DEBUG util.py:393:  perl-File-Temp-0.23.01-3.el7.noarch
DEBUG util.py:393:  perl-libs-5.16.3-286.el7.aarch64
DEBUG util.py:393:  perl-Pod-Simple-3.28-4.el7.noarch
DEBUG util.py:393:  perl-5.16.3-286.el7.aarch64
DEBUG util.py:393:  tar-1.26-29.el7.aarch64
DEBUG util.py:393:  dwz-0.11-3.el7.aarch64
DEBUG util.py:393:  cyrus-sasl-lib-2.1.26-20.el7.aarch64
DEBUG util.py:393:  zip-3.0-10.el7.aarch64
DEBUG util.py:393:  libidn-1.28-4.el7.aarch64
DEBUG util.py:393:  diffutils-3.3-4.el7.aarch64
DEBUG util.py:393:  libxml2-2.9.1-6.el7.2.aarch64
DEBUG util.py:393:  pkgconfig-0.27.1-4.el7.aarch64
DEBUG util.py:393:  xz-5.1.2-12alpha.el7.aarch64
DEBUG util.py:393:  glibc-devel-2.17-106.el7.4.aarch64
DEBUG util.py:393:  ncurses-5.9-13.20130511.el7.aarch64
DEBUG util.py:393:  pth-2.0.7-23.el7.aarch64
DEBUG util.py:393:  p11-kit-trust-0.20.7-3.el7.aarch64
DEBUG util.py:393:  libsemanage-2.1.10-18.el7.aarch64
DEBUG util.py:393:  libverto-0.2.5-4.el7.aarch64
DEBUG util.py:393:  openssl-libs-1.0.1e-51.el7.4.aarch64
DEBUG util.py:393:  ca-certificates-2015.2.6-70.1.el7_2.noarch
DEBUG util.py:393:  cracklib-2.9.0-11.el7.aarch64
DEBUG util.py:393:  libblkid-2.23.2-26.el7_2.2.aarch64
DEBUG util.py:393:  libpwquality-1.2.3-4.el7.aarch64
DEBUG util.py:393:  systemd-libs-219-19.el7.4.aarch64
DEBUG util.py:393:  gdb-7.6.1-80.el7.aarch64
DEBUG util.py:393:  libutempter-1.1.6-4.el7.aarch64
DEBUG util.py:393:  nss-sysinit-3.21.0-9.el7.centos.aarch64
DEBUG util.py:393:  libssh2-1.4.3-10.el7_2.1.aarch64
DEBUG util.py:393:  curl-7.29.0-25.el7.aarch64
DEBUG util.py:393:  rpm-4.11.3-17.el7.aarch64
DEBUG util.py:393:  gnupg2-2.0.22-3.el7.aarch64
DEBUG util.py:393:  libuser-0.60-7.el7.aarch64
DEBUG util.py:393:  libcap-ng-0.7.5-4.el7.aarch64
DEBUG util.py:393:  rpm-build-4.11.3-17.el7.aarch64
DEBUG util.py:393:  which-2.20-7.el7.aarch64
DEBUG util.py:515:  Child return code was: 0
DEBUG util.py:535:  child environment: None
DEBUG util.py:468:  Executing command: ['/bin/rpm', '-Uvh', '--nodeps', '/builddir/build/originals/hping3-0.0.20051105-22.el7.src.rpm'] with env {'LANG': 'en_GB.UTF-8', 'TERM': 'vt100', 'SHELL': '/bin/bash', 'PROMPT_COMMAND': 'printf "\x1b]0;<mock-chroot>\x07<mock-chroot>"', 'PATH': '/usr/bin:/bin:/usr/sbin:/sbin', 'HOME': '/builddir', 'HOSTNAME': 'mock'} and shell False
DEBUG util.py:393:  warning: /builddir/build/originals/hping3-0.0.20051105-22.el7.src.rpm: Header V3 RSA/SHA256 Signature, key ID 352c64e5: NOKEY
DEBUG util.py:393:  Updating / installing...
DEBUG util.py:393:  hping3-0.0.20051105-22.el7            ########################################
DEBUG util.py:515:  Child return code was: 0
DEBUG util.py:535:  child environment: None
DEBUG util.py:468:  Executing command: ['/bin/rpm', '-qpl', '/builddir/build/originals/hping3-0.0.20051105-22.el7.src.rpm'] with env {'LANG': 'en_GB.UTF-8', 'TERM': 'vt100', 'SHELL': '/bin/bash', 'PROMPT_COMMAND': 'printf "\x1b]0;<mock-chroot>\x07<mock-chroot>"', 'PATH': '/usr/bin:/bin:/usr/sbin:/sbin', 'HOME': '/builddir', 'HOSTNAME': 'mock'} and shell False
DEBUG util.py:393:  warning: /builddir/build/originals/hping3-0.0.20051105-22.el7.src.rpm: Header V3 RSA/SHA256 Signature, key ID 352c64e5: NOKEY
DEBUG util.py:393:  hping3-20051105-typo.patch
DEBUG util.py:393:  hping3-20051105.tar.gz
DEBUG util.py:393:  hping3-bytesex.patch
DEBUG util.py:393:  hping3-cflags.patch
DEBUG util.py:393:  hping3-getifnamedebug.patch
DEBUG util.py:393:  hping3-include.patch
DEBUG util.py:393:  hping3-man.patch
DEBUG util.py:393:  hping3.spec
DEBUG util.py:515:  Child return code was: 0
DEBUG util.py:535:  child environment: None
DEBUG package_manager.py:92:  ['/usr/bin/yum-builddep', '--installroot', '/srv/build/7/aarch64-C/mock-root/c7-epel.a64-aarch64/root/', '/srv/build/7/aarch64-C/mock-root/c7-epel.a64-aarch64/root//builddir/build/SRPMS/hping3-0.0.20051105-22.el7.src.rpm']
DEBUG util.py:535:  child environment: None
DEBUG util.py:468:  Executing command: ['/usr/bin/yum-builddep', '--installroot', '/srv/build/7/aarch64-C/mock-root/c7-epel.a64-aarch64/root/', '/srv/build/7/aarch64-C/mock-root/c7-epel.a64-aarch64/root//builddir/build/SRPMS/hping3-0.0.20051105-22.el7.src.rpm', '--setopt=tsflags=nocontexts'] with env {'LANG': 'en_GB.UTF-8', 'TERM': 'vt100', 'SHELL': '/bin/bash', 'LC_MESSAGES': 'C', 'PROMPT_COMMAND': 'printf "\x1b]0;<mock-chroot>\x07<mock-chroot>"', 'PATH': '/usr/bin:/bin:/usr/sbin:/sbin', 'HOME': '/builddir', 'HOSTNAME': 'mock'} and shell False
DEBUG util.py:393:  Getting requirements for hping3-0.0.20051105-22.el7.src
DEBUG util.py:393:   --> 14:libpcap-devel-1.5.3-8.el7.aarch64
DEBUG util.py:393:   --> 1:tcl-devel-8.5.13-8.el7.aarch64
DEBUG util.py:393:  ================================================================================
DEBUG util.py:393:   Package            Arch         Version              Repository           Size
DEBUG util.py:393:  ================================================================================
DEBUG util.py:393:  Installing:
DEBUG util.py:393:   libpcap-devel      aarch64      14:1.5.3-8.el7       c7.1511.00.a64      117 k
DEBUG util.py:393:   tcl-devel          aarch64      1:8.5.13-8.el7       c7.1511.00.a64      165 k
DEBUG util.py:393:  Installing for dependencies:
DEBUG util.py:393:   libpcap            aarch64      14:1.5.3-8.el7       c7.1511.00.a64      131 k
DEBUG util.py:393:   tcl                aarch64      1:8.5.13-8.el7       c7.1511.00.a64      1.8 M
DEBUG util.py:393:  Transaction Summary
DEBUG util.py:393:  ================================================================================
DEBUG util.py:393:  Install  2 Packages (+2 Dependent packages)
DEBUG util.py:393:  Total download size: 2.2 M
DEBUG util.py:393:  Installed size: 5.6 M
DEBUG util.py:393:  Installed:
DEBUG util.py:393:    libpcap-devel.aarch64 14:1.5.3-8.el7     tcl-devel.aarch64 1:8.5.13-8.el7    
DEBUG util.py:393:  Dependency Installed:
DEBUG util.py:393:    libpcap.aarch64 14:1.5.3-8.el7           tcl.aarch64 1:8.5.13-8.el7          
DEBUG util.py:515:  Child return code was: 0
DEBUG util.py:535:  child environment: None
DEBUG util.py:172:  kill orphans
DEBUG util.py:535:  child environment: None
DEBUG util.py:468:  Executing command: ['/bin/umount', '-n', '/srv/build/7/aarch64-C/mock-root/c7-epel.a64-aarch64/root/proc/filesystems'] with env {'LANG': 'en_GB.UTF-8', 'TERM': 'vt100', 'SHELL': '/bin/sh', 'HOSTNAME': 'mock', 'HOME': '/builddir', 'PATH': '/usr/bin:/bin:/usr/sbin:/sbin'} and shell False
DEBUG util.py:515:  Child return code was: 0
DEBUG util.py:535:  child environment: None
DEBUG util.py:468:  Executing command: ['/bin/umount', '-n', '-l', '/srv/build/7/aarch64-C/mock-root/c7-epel.a64-aarch64/root/dev/pts'] with env {'LANG': 'en_GB.UTF-8', 'TERM': 'vt100', 'SHELL': '/bin/sh', 'HOSTNAME': 'mock', 'HOME': '/builddir', 'PATH': '/usr/bin:/bin:/usr/sbin:/sbin'} and shell False
DEBUG util.py:515:  Child return code was: 0
DEBUG util.py:535:  child environment: None
DEBUG util.py:468:  Executing command: ['/bin/umount', '-n', '-l', '/srv/build/7/aarch64-C/mock-root/c7-epel.a64-aarch64/root/dev/shm'] with env {'LANG': 'en_GB.UTF-8', 'TERM': 'vt100', 'SHELL': '/bin/sh', 'HOSTNAME': 'mock', 'HOME': '/builddir', 'PATH': '/usr/bin:/bin:/usr/sbin:/sbin'} and shell False
DEBUG util.py:515:  Child return code was: 0
DEBUG util.py:535:  child environment: None
DEBUG util.py:468:  Executing command: ['/bin/umount', '-n', '-l', '/srv/build/7/aarch64-C/mock-root/c7-epel.a64-aarch64/root/sys'] with env {'LANG': 'en_GB.UTF-8', 'TERM': 'vt100', 'SHELL': '/bin/sh', 'HOSTNAME': 'mock', 'HOME': '/builddir', 'PATH': '/usr/bin:/bin:/usr/sbin:/sbin'} and shell False
DEBUG util.py:515:  Child return code was: 0
DEBUG util.py:535:  child environment: None
DEBUG util.py:468:  Executing command: ['/bin/umount', '-n', '-l', '/srv/build/7/aarch64-C/mock-root/c7-epel.a64-aarch64/root/proc'] with env {'LANG': 'en_GB.UTF-8', 'TERM': 'vt100', 'SHELL': '/bin/sh', 'HOSTNAME': 'mock', 'HOME': '/builddir', 'PATH': '/usr/bin:/bin:/usr/sbin:/sbin'} and shell False
DEBUG util.py:515:  Child return code was: 0
DEBUG util.py:535:  child environment: None
DEBUG util.py:468:  Executing command: ['btrfs', 'subv', 'list', '/srv/build/7/aarch64-C/mock-root'] with env {'LANG': 'en_GB.UTF-8', 'TERM': 'vt100', 'SHELL': '/bin/sh', 'HOSTNAME': 'mock', 'HOME': '/builddir', 'PATH': '/usr/bin:/bin:/usr/sbin:/sbin'} and shell False
DEBUG util.py:393:  ERROR: can't perform the search - Inappropriate ioctl for device
DEBUG util.py:393:  ERROR: can't get rootid for '/srv/build/7/aarch64-C/mock-root'
DEBUG util.py:515:  Child return code was: 1
---------------------------------------------
BUILD log: ----------------( last 500 lines )-----\n\n
Mock Version: 1.2.13
ENTER do(['bash', '--login', '-c', '/usr/bin/rpmbuild -bs --target aarch64 --nodeps /builddir/build/SPECS/hping3.spec'], chrootPath='/srv/build/7/aarch64-C/mock-root/c7-epel.a64-aarch64/root'shell=FalseprintOutput=Falseenv={'LANG': 'en_GB.UTF-8', 'TERM': 'vt100', 'SHELL': '/bin/bash', 'PROMPT_COMMAND': 'printf "\x1b]0;<mock-chroot>\x07<mock-chroot>"', 'PATH': '/usr/bin:/bin:/usr/sbin:/sbin', 'HOME': '/builddir', 'HOSTNAME': 'mock'}gid=135user='mockbuild'timeout=21600logger=<mockbuild.trace_decorator.getLog object at 0x3aca06d0>uid=1006)
Executing command: ['bash', '--login', '-c', '/usr/bin/rpmbuild -bs --target aarch64 --nodeps /builddir/build/SPECS/hping3.spec'] with env {'LANG': 'en_GB.UTF-8', 'TERM': 'vt100', 'SHELL': '/bin/bash', 'PROMPT_COMMAND': 'printf "\x1b]0;<mock-chroot>\x07<mock-chroot>"', 'PATH': '/usr/bin:/bin:/usr/sbin:/sbin', 'HOME': '/builddir', 'HOSTNAME': 'mock'} and shell False
warning: bogus date in %changelog: Fri Nov 27 2008 Paul Wouters <paul at xelerance.com> - 0.0.20051105-12
warning: bogus date in %changelog: Fri Feb 22 2007 Paul Wouters <paul at xelerance.com> 0.0.20051105-7
warning: bogus date in %changelog: Sun May 19 2006 Paul Wouters <paul at xelerance.com> 0.0.20051105-2
warning: Could not canonicalize hostname: n16.lon1.centos.org
Building target platforms: aarch64
Building for target aarch64
Wrote: /builddir/build/SRPMS/hping3-0.0.20051105-22.el7.src.rpm
Child return code was: 0
LEAVE do --> 

ENTER do(['bash', '--login', '-c', '/usr/bin/rpmbuild -bb --target aarch64 --nodeps  /builddir/build/SPECS/hping3.spec '], chrootPath='/srv/build/7/aarch64-C/mock-root/c7-epel.a64-aarch64/root'shell=Falseuid=1006env={'LANG': 'en_GB.UTF-8', 'TERM': 'vt100', 'SHELL': '/bin/bash', 'PROMPT_COMMAND': 'printf "\x1b]0;<mock-chroot>\x07<mock-chroot>"', 'PATH': '/usr/bin:/bin:/usr/sbin:/sbin', 'HOME': '/builddir', 'HOSTNAME': 'mock'}gid=135user='mockbuild'timeout=21600private_network=Truelogger=<mockbuild.trace_decorator.getLog object at 0x3aca06d0>printOutput=False)
Executing command: ['bash', '--login', '-c', '/usr/bin/rpmbuild -bb --target aarch64 --nodeps  /builddir/build/SPECS/hping3.spec '] with env {'LANG': 'en_GB.UTF-8', 'TERM': 'vt100', 'SHELL': '/bin/bash', 'PROMPT_COMMAND': 'printf "\x1b]0;<mock-chroot>\x07<mock-chroot>"', 'PATH': '/usr/bin:/bin:/usr/sbin:/sbin', 'HOME': '/builddir', 'HOSTNAME': 'mock'} and shell False
warning: bogus date in %changelog: Fri Nov 27 2008 Paul Wouters <paul at xelerance.com> - 0.0.20051105-12
warning: bogus date in %changelog: Fri Feb 22 2007 Paul Wouters <paul at xelerance.com> 0.0.20051105-7
warning: bogus date in %changelog: Sun May 19 2006 Paul Wouters <paul at xelerance.com> 0.0.20051105-2
Building target platforms: aarch64
Building for target aarch64
Executing(%prep): /bin/sh -e /var/tmp/rpm-tmp.cxFsuB
+ umask 022
+ cd /builddir/build/BUILD
+ cd /builddir/build/BUILD
+ rm -rf hping3-20051105
+ /usr/bin/gzip -dc /builddir/build/SOURCES/hping3-20051105.tar.gz
+ /usr/bin/tar -xf -
+ STATUS=0
+ '[' 0 -ne 0 ']'
+ cd hping3-20051105
+ /usr/bin/chmod -Rf a+rX,u+w,g-w,o-w .
+ echo 'Patch #0 (hping3-include.patch):'
Patch #0 (hping3-include.patch):
+ /usr/bin/cat /builddir/build/SOURCES/hping3-include.patch
+ /usr/bin/patch -p0 -b --suffix .include --fuzz=0
patching file script.c
patching file libpcap_stuff.c
+ echo 'Patch #1 (hping3-bytesex.patch):'
Patch #1 (hping3-bytesex.patch):
+ /usr/bin/cat /builddir/build/SOURCES/hping3-bytesex.patch
+ /usr/bin/patch -p0 -b --suffix .bytesex --fuzz=0
patching file bytesex.h
+ echo 'Patch #2 (hping3-getifnamedebug.patch):'
Patch #2 (hping3-getifnamedebug.patch):
+ /usr/bin/cat /builddir/build/SOURCES/hping3-getifnamedebug.patch
+ /usr/bin/patch -p1 -b --suffix .getifnamedebug --fuzz=0
patching file getifname.c
Hunk #1 succeeded at 59 (offset -1 lines).
Patch #3 (hping3-cflags.patch):
+ echo 'Patch #3 (hping3-cflags.patch):'
+ /usr/bin/cat /builddir/build/SOURCES/hping3-cflags.patch
+ /usr/bin/patch -p0 -b --suffix .cflags --fuzz=0
patching file Makefile.in
+ echo 'Patch #4 (hping3-man.patch):'
Patch #4 (hping3-man.patch):
+ /usr/bin/cat /builddir/build/SOURCES/hping3-man.patch
+ /usr/bin/patch -p0 -b --suffix .man --fuzz=0
patching file docs/hping3.8
+ echo 'Patch #5 (hping3-20051105-typo.patch):'
Patch #5 (hping3-20051105-typo.patch):
+ /usr/bin/cat /builddir/build/SOURCES/hping3-20051105-typo.patch
+ /usr/bin/patch -p1 --fuzz=0
patching file statistics.c
+ exit 0
Executing(%build): /bin/sh -e /var/tmp/rpm-tmp.INXBcj
+ umask 022
+ cd /builddir/build/BUILD
+ cd hping3-20051105
+ CFLAGS='-O2 -g -pipe -Wall -Wp,-D_FORTIFY_SOURCE=2 -fexceptions -fstack-protector-strong --param=ssp-buffer-size=4 -grecord-gcc-switches  '
+ export CFLAGS
+ CXXFLAGS='-O2 -g -pipe -Wall -Wp,-D_FORTIFY_SOURCE=2 -fexceptions -fstack-protector-strong --param=ssp-buffer-size=4 -grecord-gcc-switches  '
+ export CXXFLAGS
+ FFLAGS='-O2 -g -pipe -Wall -Wp,-D_FORTIFY_SOURCE=2 -fexceptions -fstack-protector-strong --param=ssp-buffer-size=4 -grecord-gcc-switches   -I/usr/lib64/gfortran/modules'
+ export FFLAGS
+ FCFLAGS='-O2 -g -pipe -Wall -Wp,-D_FORTIFY_SOURCE=2 -fexceptions -fstack-protector-strong --param=ssp-buffer-size=4 -grecord-gcc-switches   -I/usr/lib64/gfortran/modules'
+ export FCFLAGS
+ LDFLAGS='-Wl,-z,relro '
+ export LDFLAGS
+ '[' 1 == 1 ']'
+ '[' aarch64 == ppc64le ']'
++ find . -name config.guess -o -name config.sub
+ ./configure --build=aarch64-redhat-linux-gnu --host=aarch64-redhat-linux-gnu --program-prefix= --disable-dependency-tracking --prefix=/usr --exec-prefix=/usr --bindir=/usr/bin --sbindir=/usr/sbin --sysconfdir=/etc --datadir=/usr/share --includedir=/usr/include --libdir=/usr/lib64 --libexecdir=/usr/libexec --localstatedir=/var --sharedstatedir=/var/lib --mandir=/usr/share/man --infodir=/usr/share/info --force-libpcap
build byteorder.c...
create byteorder.h...
./configure: line 81: -: command not found
--------------------------------------
system type: LINUX
LIBPCAP      : PCAP=-lpcap
PCAP_INCLUDE : 
MANPATH      : /usr/local/man
USE_TCL      : -DUSE_TCL
TCL_VER      : 
TCL_INC      : 
LIBTCL       : -ltcl -lm -lpthread
TCLSH        : 
(to modify try configure --help)
--------------------------------------
creating Makefile...
creating dependences...
In file included from ars.h:20:0,
                 from apd.c:19:
bytesex.h:28:3: error: #error can not find the byte order for this architecture, fix bytesex.h
 # error can not find the byte order for this architecture, fix bytesex.h
   ^
In file included from apd.c:19:0:
ars.h:190:2: error: #error "Please, edit Makefile and add -DBYTE_ORDER_(BIG|LITTLE)_ENDIAN"
 #error  "Please, edit Makefile and add -DBYTE_ORDER_(BIG|LITTLE)_ENDIAN"
  ^
ars.h:254:2: error: #error "Please, edit Makefile and add -DBYTE_ORDER_(BIG|LITTLE)_ENDIAN"
 #error  "Please, edit Makefile and add -DBYTE_ORDER_(BIG|LITTLE)_ENDIAN"
  ^
ars.h:323:2: error: #error "Please, edit Makefile and add -DBYTE_ORDER_(BIG|LITTLE)_ENDIAN"
 #error  "Please, edit Makefile and add -DBYTE_ORDER_(BIG|LITTLE)_ENDIAN"
  ^
In file included from ars.h:20:0,
                 from ars.c:24:
bytesex.h:28:3: error: #error can not find the byte order for this architecture, fix bytesex.h
 # error can not find the byte order for this architecture, fix bytesex.h
   ^
In file included from ars.c:24:0:
ars.h:190:2: error: #error "Please, edit Makefile and add -DBYTE_ORDER_(BIG|LITTLE)_ENDIAN"
 #error  "Please, edit Makefile and add -DBYTE_ORDER_(BIG|LITTLE)_ENDIAN"
  ^
ars.h:254:2: error: #error "Please, edit Makefile and add -DBYTE_ORDER_(BIG|LITTLE)_ENDIAN"
 #error  "Please, edit Makefile and add -DBYTE_ORDER_(BIG|LITTLE)_ENDIAN"
  ^
ars.h:323:2: error: #error "Please, edit Makefile and add -DBYTE_ORDER_(BIG|LITTLE)_ENDIAN"
 #error  "Please, edit Makefile and add -DBYTE_ORDER_(BIG|LITTLE)_ENDIAN"
  ^
In file included from ars.h:20:0,
                 from arsglue.c:7:
bytesex.h:28:3: error: #error can not find the byte order for this architecture, fix bytesex.h
 # error can not find the byte order for this architecture, fix bytesex.h
   ^
In file included from arsglue.c:7:0:
ars.h:190:2: error: #error "Please, edit Makefile and add -DBYTE_ORDER_(BIG|LITTLE)_ENDIAN"
 #error  "Please, edit Makefile and add -DBYTE_ORDER_(BIG|LITTLE)_ENDIAN"
  ^
ars.h:254:2: error: #error "Please, edit Makefile and add -DBYTE_ORDER_(BIG|LITTLE)_ENDIAN"
 #error  "Please, edit Makefile and add -DBYTE_ORDER_(BIG|LITTLE)_ENDIAN"
  ^
ars.h:323:2: error: #error "Please, edit Makefile and add -DBYTE_ORDER_(BIG|LITTLE)_ENDIAN"
 #error  "Please, edit Makefile and add -DBYTE_ORDER_(BIG|LITTLE)_ENDIAN"
  ^
In file included from ars.h:20:0,
                 from rapd.c:11:
bytesex.h:28:3: error: #error can not find the byte order for this architecture, fix bytesex.h
 # error can not find the byte order for this architecture, fix bytesex.h
   ^
In file included from rapd.c:11:0:
ars.h:190:2: error: #error "Please, edit Makefile and add -DBYTE_ORDER_(BIG|LITTLE)_ENDIAN"
 #error  "Please, edit Makefile and add -DBYTE_ORDER_(BIG|LITTLE)_ENDIAN"
  ^
ars.h:254:2: error: #error "Please, edit Makefile and add -DBYTE_ORDER_(BIG|LITTLE)_ENDIAN"
 #error  "Please, edit Makefile and add -DBYTE_ORDER_(BIG|LITTLE)_ENDIAN"
  ^
ars.h:323:2: error: #error "Please, edit Makefile and add -DBYTE_ORDER_(BIG|LITTLE)_ENDIAN"
 #error  "Please, edit Makefile and add -DBYTE_ORDER_(BIG|LITTLE)_ENDIAN"
  ^
In file included from ars.h:20:0,
                 from split.c:11:
bytesex.h:28:3: error: #error can not find the byte order for this architecture, fix bytesex.h
 # error can not find the byte order for this architecture, fix bytesex.h
   ^
In file included from split.c:11:0:
ars.h:190:2: error: #error "Please, edit Makefile and add -DBYTE_ORDER_(BIG|LITTLE)_ENDIAN"
 #error  "Please, edit Makefile and add -DBYTE_ORDER_(BIG|LITTLE)_ENDIAN"
  ^
ars.h:254:2: error: #error "Please, edit Makefile and add -DBYTE_ORDER_(BIG|LITTLE)_ENDIAN"
 #error  "Please, edit Makefile and add -DBYTE_ORDER_(BIG|LITTLE)_ENDIAN"
  ^
ars.h:323:2: error: #error "Please, edit Makefile and add -DBYTE_ORDER_(BIG|LITTLE)_ENDIAN"
 #error  "Please, edit Makefile and add -DBYTE_ORDER_(BIG|LITTLE)_ENDIAN"
  ^
now you can try `make'
+ make -j8
gcc -c -O2 -g -pipe -Wall -Wp,-D_FORTIFY_SOURCE=2 -fexceptions -fstack-protector-strong --param=ssp-buffer-size=4 -grecord-gcc-switches   -Wall   -DUSE_TCL -g  main.c
gcc -c -O2 -g -pipe -Wall -Wp,-D_FORTIFY_SOURCE=2 -fexceptions -fstack-protector-strong --param=ssp-buffer-size=4 -grecord-gcc-switches   -Wall   -DUSE_TCL -g  getifname.c
gcc -c -O2 -g -pipe -Wall -Wp,-D_FORTIFY_SOURCE=2 -fexceptions -fstack-protector-strong --param=ssp-buffer-size=4 -grecord-gcc-switches   -Wall   -DUSE_TCL -g  getlhs.c
gcc -c -O2 -g -pipe -Wall -Wp,-D_FORTIFY_SOURCE=2 -fexceptions -fstack-protector-strong --param=ssp-buffer-size=4 -grecord-gcc-switches   -Wall   -DUSE_TCL -g  parseoptions.c
gcc -c -O2 -g -pipe -Wall -Wp,-D_FORTIFY_SOURCE=2 -fexceptions -fstack-protector-strong --param=ssp-buffer-size=4 -grecord-gcc-switches   -Wall   -DUSE_TCL -g  datafiller.c
gcc -c -O2 -g -pipe -Wall -Wp,-D_FORTIFY_SOURCE=2 -fexceptions -fstack-protector-strong --param=ssp-buffer-size=4 -grecord-gcc-switches   -Wall   -DUSE_TCL -g  datahandler.c
gcc -c -O2 -g -pipe -Wall -Wp,-D_FORTIFY_SOURCE=2 -fexceptions -fstack-protector-strong --param=ssp-buffer-size=4 -grecord-gcc-switches   -Wall   -DUSE_TCL -g  gethostname.c
gcc -c -O2 -g -pipe -Wall -Wp,-D_FORTIFY_SOURCE=2 -fexceptions -fstack-protector-strong --param=ssp-buffer-size=4 -grecord-gcc-switches   -Wall   -DUSE_TCL -g  binding.c
getifname.c: In function 'get_output_if':
gcc -c -O2 -g -pipe -Wall -Wp,-D_FORTIFY_SOURCE=2 -fexceptions -fstack-protector-strong --param=ssp-buffer-size=4 -grecord-gcc-switches   -Wall   -DUSE_TCL -g  getusec.c
getifname.c:343:35: warning: pointer targets in passing argument 3 of 'getsockname' differ in signedness [-Wpointer-sign]
  if (getsockname(sock_rt, (struct sockaddr *)&iface_out, &len) == -1 ) {
                                   ^
In file included from getifname.c:14:0:
/usr/include/sys/socket.h:128:12: note: expected 'socklen_t * __restrict__' but argument is of type 'int *'
 extern int getsockname (int __fd, __SOCKADDR_ARG __addr,
            ^
gcc -c -O2 -g -pipe -Wall -Wp,-D_FORTIFY_SOURCE=2 -fexceptions -fstack-protector-strong --param=ssp-buffer-size=4 -grecord-gcc-switches   -Wall   -DUSE_TCL -g  opensockraw.c
gcc -c -O2 -g -pipe -Wall -Wp,-D_FORTIFY_SOURCE=2 -fexceptions -fstack-protector-strong --param=ssp-buffer-size=4 -grecord-gcc-switches   -Wall   -DUSE_TCL -g  logicmp.c
gcc -c -O2 -g -pipe -Wall -Wp,-D_FORTIFY_SOURCE=2 -fexceptions -fstack-protector-strong --param=ssp-buffer-size=4 -grecord-gcc-switches   -Wall   -DUSE_TCL -g  waitpacket.c
gcc -c -O2 -g -pipe -Wall -Wp,-D_FORTIFY_SOURCE=2 -fexceptions -fstack-protector-strong --param=ssp-buffer-size=4 -grecord-gcc-switches   -Wall   -DUSE_TCL -g  resolve.c
gcc -c -O2 -g -pipe -Wall -Wp,-D_FORTIFY_SOURCE=2 -fexceptions -fstack-protector-strong --param=ssp-buffer-size=4 -grecord-gcc-switches   -Wall   -DUSE_TCL -g  sendip.c
gcc -c -O2 -g -pipe -Wall -Wp,-D_FORTIFY_SOURCE=2 -fexceptions -fstack-protector-strong --param=ssp-buffer-size=4 -grecord-gcc-switches   -Wall   -DUSE_TCL -g  sendicmp.c
gcc -c -O2 -g -pipe -Wall -Wp,-D_FORTIFY_SOURCE=2 -fexceptions -fstack-protector-strong --param=ssp-buffer-size=4 -grecord-gcc-switches   -Wall   -DUSE_TCL -g  sendudp.c
gcc -c -O2 -g -pipe -Wall -Wp,-D_FORTIFY_SOURCE=2 -fexceptions -fstack-protector-strong --param=ssp-buffer-size=4 -grecord-gcc-switches   -Wall   -DUSE_TCL -g  sendtcp.c
gcc -c -O2 -g -pipe -Wall -Wp,-D_FORTIFY_SOURCE=2 -fexceptions -fstack-protector-strong --param=ssp-buffer-size=4 -grecord-gcc-switches   -Wall   -DUSE_TCL -g  cksum.c
gcc -c -O2 -g -pipe -Wall -Wp,-D_FORTIFY_SOURCE=2 -fexceptions -fstack-protector-strong --param=ssp-buffer-size=4 -grecord-gcc-switches   -Wall   -DUSE_TCL -g  statistics.c
gcc -c -O2 -g -pipe -Wall -Wp,-D_FORTIFY_SOURCE=2 -fexceptions -fstack-protector-strong --param=ssp-buffer-size=4 -grecord-gcc-switches   -Wall   -DUSE_TCL -g  usage.c
gcc -c -O2 -g -pipe -Wall -Wp,-D_FORTIFY_SOURCE=2 -fexceptions -fstack-protector-strong --param=ssp-buffer-size=4 -grecord-gcc-switches   -Wall   -DUSE_TCL -g  version.c
gcc -c -O2 -g -pipe -Wall -Wp,-D_FORTIFY_SOURCE=2 -fexceptions -fstack-protector-strong --param=ssp-buffer-size=4 -grecord-gcc-switches   -Wall   -DUSE_TCL -g  antigetopt.c
gcc -c -O2 -g -pipe -Wall -Wp,-D_FORTIFY_SOURCE=2 -fexceptions -fstack-protector-strong --param=ssp-buffer-size=4 -grecord-gcc-switches   -Wall   -DUSE_TCL -g  sockopt.c
gcc -c -O2 -g -pipe -Wall -Wp,-D_FORTIFY_SOURCE=2 -fexceptions -fstack-protector-strong --param=ssp-buffer-size=4 -grecord-gcc-switches   -Wall   -DUSE_TCL -g  listen.c
waitpacket.c: In function 'wait_packet':
waitpacket.c:546:14: warning: 'tstamp' may be used uninitialized in this function [-Wmaybe-uninitialized]
  last_tstamp = tstamp;
              ^
waitpacket.c:469:8: note: 'tstamp' was declared here
  __u32 tstamp, echo;
        ^
gcc -c -O2 -g -pipe -Wall -Wp,-D_FORTIFY_SOURCE=2 -fexceptions -fstack-protector-strong --param=ssp-buffer-size=4 -grecord-gcc-switches   -Wall   -DUSE_TCL -g  sendhcmp.c
gcc -c -O2 -g -pipe -Wall -Wp,-D_FORTIFY_SOURCE=2 -fexceptions -fstack-protector-strong --param=ssp-buffer-size=4 -grecord-gcc-switches   -Wall   -DUSE_TCL -g  memstr.c
gcc -c -O2 -g -pipe -Wall -Wp,-D_FORTIFY_SOURCE=2 -fexceptions -fstack-protector-strong --param=ssp-buffer-size=4 -grecord-gcc-switches   -Wall   -DUSE_TCL -g  rtt.c
gcc -c -O2 -g -pipe -Wall -Wp,-D_FORTIFY_SOURCE=2 -fexceptions -fstack-protector-strong --param=ssp-buffer-size=4 -grecord-gcc-switches   -Wall   -DUSE_TCL -g  relid.c
listen.c: In function 'listenmain':
listen.c:77:9: warning: ignoring return value of 'write', declared with attribute warn_unused_result [-Wunused-result]
    write(stdoutFD, p, size-(p-ip_packet));
         ^
gcc -c -O2 -g -pipe -Wall -Wp,-D_FORTIFY_SOURCE=2 -fexceptions -fstack-protector-strong --param=ssp-buffer-size=4 -grecord-gcc-switches   -Wall   -DUSE_TCL -g  sendip_handler.c
gcc -c -O2 -g -pipe -Wall -Wp,-D_FORTIFY_SOURCE=2 -fexceptions -fstack-protector-strong --param=ssp-buffer-size=4 -grecord-gcc-switches   -Wall   -DUSE_TCL -g  libpcap_stuff.c
gcc -c -O2 -g -pipe -Wall -Wp,-D_FORTIFY_SOURCE=2 -fexceptions -fstack-protector-strong --param=ssp-buffer-size=4 -grecord-gcc-switches   -Wall   -DUSE_TCL -g  memlockall.c
gcc -c -O2 -g -pipe -Wall -Wp,-D_FORTIFY_SOURCE=2 -fexceptions -fstack-protector-strong --param=ssp-buffer-size=4 -grecord-gcc-switches   -Wall   -DUSE_TCL -g  memunlockall.c
gcc -c -O2 -g -pipe -Wall -Wp,-D_FORTIFY_SOURCE=2 -fexceptions -fstack-protector-strong --param=ssp-buffer-size=4 -grecord-gcc-switches   -Wall   -DUSE_TCL -g  memlock.c
gcc -c -O2 -g -pipe -Wall -Wp,-D_FORTIFY_SOURCE=2 -fexceptions -fstack-protector-strong --param=ssp-buffer-size=4 -grecord-gcc-switches   -Wall   -DUSE_TCL -g  memunlock.c
gcc -c -O2 -g -pipe -Wall -Wp,-D_FORTIFY_SOURCE=2 -fexceptions -fstack-protector-strong --param=ssp-buffer-size=4 -grecord-gcc-switches   -Wall   -DUSE_TCL -g  ip_opt_build.c
gcc -c -O2 -g -pipe -Wall -Wp,-D_FORTIFY_SOURCE=2 -fexceptions -fstack-protector-strong --param=ssp-buffer-size=4 -grecord-gcc-switches   -Wall   -DUSE_TCL -g  display_ipopt.c
gcc -c -O2 -g -pipe -Wall -Wp,-D_FORTIFY_SOURCE=2 -fexceptions -fstack-protector-strong --param=ssp-buffer-size=4 -grecord-gcc-switches   -Wall   -DUSE_TCL -g  sendrawip.c
libpcap_stuff.c: In function 'open_pcap':
libpcap_stuff.c:26:6: warning: variable 'on' set but not used [-Wunused-but-set-variable]
  int on;
      ^
libpcap_stuff.c: In function 'pcap_recv':
libpcap_stuff.c:61:19: warning: pointer targets in assignment differ in signedness [-Wpointer-sign]
                 p = (unsigned char*) pcap_next(pcapfp, &hdr);
                   ^
gcc -c -O2 -g -pipe -Wall -Wp,-D_FORTIFY_SOURCE=2 -fexceptions -fstack-protector-strong --param=ssp-buffer-size=4 -grecord-gcc-switches   -Wall   -DUSE_TCL -g  signal.c
gcc -c -O2 -g -pipe -Wall -Wp,-D_FORTIFY_SOURCE=2 -fexceptions -fstack-protector-strong --param=ssp-buffer-size=4 -grecord-gcc-switches   -Wall   -DUSE_TCL -g  send.c
gcc -c -O2 -g -pipe -Wall -Wp,-D_FORTIFY_SOURCE=2 -fexceptions -fstack-protector-strong --param=ssp-buffer-size=4 -grecord-gcc-switches   -Wall   -DUSE_TCL -g  strlcpy.c
gcc -c -O2 -g -pipe -Wall -Wp,-D_FORTIFY_SOURCE=2 -fexceptions -fstack-protector-strong --param=ssp-buffer-size=4 -grecord-gcc-switches   -Wall   -DUSE_TCL -g  arsglue.c
ip_opt_build.c: In function 'ip_opt_build':
ip_opt_build.c:28:29: warning: argument to 'sizeof' in 'memset' call is the same expression as the destination; did you mean to provide an explicit length? [-Wsizeof-pointer-memaccess]
     memset(ip_opt, 1, sizeof(ip_opt));
                             ^
gcc -c -O2 -g -pipe -Wall -Wp,-D_FORTIFY_SOURCE=2 -fexceptions -fstack-protector-strong --param=ssp-buffer-size=4 -grecord-gcc-switches   -Wall   -DUSE_TCL -g  random.c
gcc -c -O2 -g -pipe -Wall -Wp,-D_FORTIFY_SOURCE=2 -fexceptions -fstack-protector-strong --param=ssp-buffer-size=4 -grecord-gcc-switches   -Wall   -DUSE_TCL -g  scan.c
gcc -c -O2 -g -pipe -Wall -Wp,-D_FORTIFY_SOURCE=2 -fexceptions -fstack-protector-strong --param=ssp-buffer-size=4 -grecord-gcc-switches   -Wall   -DUSE_TCL -g  hstring.c
gcc -c -O2 -g -pipe -Wall -Wp,-D_FORTIFY_SOURCE=2 -fexceptions -fstack-protector-strong --param=ssp-buffer-size=4 -grecord-gcc-switches   -Wall   -DUSE_TCL -g  script.c
In file included from ars.h:20:0,
                 from arsglue.c:7:
bytesex.h:28:3: error: #error can not find the byte order for this architecture, fix bytesex.h
 # error can not find the byte order for this architecture, fix bytesex.h
   ^
In file included from arsglue.c:7:0:
ars.h:190:2: error: #error "Please, edit Makefile and add -DBYTE_ORDER_(BIG|LITTLE)_ENDIAN"
 #error  "Please, edit Makefile and add -DBYTE_ORDER_(BIG|LITTLE)_ENDIAN"
  ^
ars.h:254:2: error: #error "Please, edit Makefile and add -DBYTE_ORDER_(BIG|LITTLE)_ENDIAN"
 #error  "Please, edit Makefile and add -DBYTE_ORDER_(BIG|LITTLE)_ENDIAN"
  ^
ars.h:323:2: error: #error "Please, edit Makefile and add -DBYTE_ORDER_(BIG|LITTLE)_ENDIAN"
 #error  "Please, edit Makefile and add -DBYTE_ORDER_(BIG|LITTLE)_ENDIAN"
  ^
random.c: In function 'hp_rand_init':
random.c:32:7: warning: ignoring return value of 'read', declared with attribute warn_unused_result [-Wunused-result]
   read(fd, rc4_sbox, 256);
       ^
make: *** [arsglue.o] Error 1
make: *** Waiting for unfinished jobs....
scan.c: In function 'receiver':
scan.c:458:6: warning: pointer targets in assignment differ in signedness [-Wpointer-sign]
    p = packet+linkhdr_size+iphdrlen;
      ^
In file included from ars.h:20:0,
                 from script.c:31:
bytesex.h:28:3: error: #error can not find the byte order for this architecture, fix bytesex.h
 # error can not find the byte order for this architecture, fix bytesex.h
   ^
In file included from script.c:31:0:
ars.h:190:2: error: #error "Please, edit Makefile and add -DBYTE_ORDER_(BIG|LITTLE)_ENDIAN"
 #error  "Please, edit Makefile and add -DBYTE_ORDER_(BIG|LITTLE)_ENDIAN"
  ^
ars.h:254:2: error: #error "Please, edit Makefile and add -DBYTE_ORDER_(BIG|LITTLE)_ENDIAN"
 #error  "Please, edit Makefile and add -DBYTE_ORDER_(BIG|LITTLE)_ENDIAN"
  ^
ars.h:323:2: error: #error "Please, edit Makefile and add -DBYTE_ORDER_(BIG|LITTLE)_ENDIAN"
 #error  "Please, edit Makefile and add -DBYTE_ORDER_(BIG|LITTLE)_ENDIAN"
  ^
script.c: In function 'GetPacketDescription':
script.c:265:21: warning: pointer targets in initialization differ in signedness [-Wpointer-sign]
  unsigned char *p = (char*)data;
                     ^
script.c: In function 'HpingSetFieldCmd':
script.c:603:24: warning: variable 'value' set but not used [-Wunused-but-set-variable]
  char *layer, *field, *value, *packet;
                        ^
make: *** [script.o] Error 1
In file included from /usr/include/string.h:638:0,
                 from scan.c:17:
In function 'memcpy',
    inlined from 'receiver.isra.0' at scan.c:459:10,
    inlined from 'scanmain' at scan.c:545:11:
/usr/include/bits/string3.h:51:3: warning: call to __builtin___memcpy_chk will always overflow destination buffer [enabled by default]
   return __builtin___memcpy_chk (__dest, __src, __len, __bos0 (__dest));
   ^
error: Bad exit status from /var/tmp/rpm-tmp.INXBcj (%build)
    bogus date in %changelog: Fri Nov 27 2008 Paul Wouters <paul at xelerance.com> - 0.0.20051105-12
    bogus date in %changelog: Fri Feb 22 2007 Paul Wouters <paul at xelerance.com> 0.0.20051105-7
    bogus date in %changelog: Sun May 19 2006 Paul Wouters <paul at xelerance.com> 0.0.20051105-2
    Bad exit status from /var/tmp/rpm-tmp.INXBcj (%build)
RPM build errors:
Child return code was: 1
EXCEPTION: Command failed. See logs for output.
 # bash --login -c /usr/bin/rpmbuild -bb --target aarch64 --nodeps  /builddir/build/SPECS/hping3.spec 
Traceback (most recent call last):
  File "/usr/lib/python2.7/site-packages/mockbuild/trace_decorator.py", line 84, in trace
    result = func(*args, **kw)
  File "/usr/lib/python2.7/site-packages/mockbuild/util.py", line 520, in do
    raise exception.Error("Command failed. See logs for output.\n # %s" % (command,), child.returncode)
Error: Command failed. See logs for output.
 # bash --login -c /usr/bin/rpmbuild -bb --target aarch64 --nodeps  /builddir/build/SPECS/hping3.spec 
LEAVE do --> EXCEPTION RAISED



More information about the CentOS-build-reports mailing list