[CentOS-build-reports] Build Fail: josm 0-0.66.8109svn.el7.aarch64 on c7-epel.a64

buildsys at centos.org buildsys at centos.org
Tue Jun 21 03:44:09 UTC 2016


ROOT log: -----------------( last 500 lines )-----\n\n
DEBUG util.py:393:    rpm.aarch64 0:4.11.3-17.el7                                                   
DEBUG util.py:393:    rpm-build-libs.aarch64 0:4.11.3-17.el7                                        
DEBUG util.py:393:    rpm-libs.aarch64 0:4.11.3-17.el7                                              
DEBUG util.py:393:    setup.noarch 0:2.8.71-6.el7                                                   
DEBUG util.py:393:    shared-mime-info.aarch64 0:1.1-9.el7                                          
DEBUG util.py:393:    sqlite.aarch64 0:3.7.17-8.el7                                                 
DEBUG util.py:393:    systemd-libs.aarch64 0:219-19.el7.4                                           
DEBUG util.py:393:    tzdata.noarch 0:2016d-1.el7                                                   
DEBUG util.py:393:    ustr.aarch64 0:1.0.4-16.el7                                                   
DEBUG util.py:393:    xz-libs.aarch64 0:5.1.2-12alpha.el7                                           
DEBUG util.py:393:    zip.aarch64 0:3.0-10.el7                                                      
DEBUG util.py:393:    zlib.aarch64 0:1.2.7-15.el7                                                   
DEBUG util.py:515:  Child return code was: 0
DEBUG util.py:108:  touching file: /srv/build/7/aarch64-A/mock-root/c7-epel.a64-aarch64/root/etc/os-release
DEBUG util.py:535:  child environment: None
DEBUG util.py:468:  Executing command: ['/usr/sbin/userdel', '-r', '-f', 'mockbuild'] with env {'LANG': 'en_GB.UTF-8', 'TERM': 'vt100', 'SHELL': '/bin/bash', 'PROMPT_COMMAND': 'printf "\x1b]0;<mock-chroot>\x07<mock-chroot>"', 'PATH': '/usr/bin:/bin:/usr/sbin:/sbin', 'HOME': '/builddir', 'HOSTNAME': 'mock'} and shell False
DEBUG util.py:393:  userdel: user 'mockbuild' does not exist
DEBUG util.py:515:  Child return code was: 6
DEBUG util.py:535:  child environment: None
DEBUG util.py:468:  Executing command: ['/usr/sbin/userdel', '-r', '-f', 'mockbuild'] with env {'LANG': 'en_GB.UTF-8', 'TERM': 'vt100', 'SHELL': '/bin/bash', 'PROMPT_COMMAND': 'printf "\x1b]0;<mock-chroot>\x07<mock-chroot>"', 'PATH': '/usr/bin:/bin:/usr/sbin:/sbin', 'HOME': '/builddir', 'HOSTNAME': 'mock'} and shell False
DEBUG util.py:393:  userdel: user 'mockbuild' does not exist
DEBUG util.py:515:  Child return code was: 6
DEBUG util.py:535:  child environment: None
DEBUG util.py:468:  Executing command: ['/usr/sbin/groupdel', 'mockbuild'] with env {'LANG': 'en_GB.UTF-8', 'TERM': 'vt100', 'SHELL': '/bin/bash', 'PROMPT_COMMAND': 'printf "\x1b]0;<mock-chroot>\x07<mock-chroot>"', 'PATH': '/usr/bin:/bin:/usr/sbin:/sbin', 'HOME': '/builddir', 'HOSTNAME': 'mock'} and shell False
DEBUG util.py:393:  groupdel: group 'mockbuild' does not exist
DEBUG util.py:515:  Child return code was: 6
DEBUG util.py:535:  child environment: None
DEBUG util.py:468:  Executing command: ['/usr/sbin/groupadd', '-g', '135', 'mockbuild'] with env {'LANG': 'en_GB.UTF-8', 'TERM': 'vt100', 'SHELL': '/bin/bash', 'PROMPT_COMMAND': 'printf "\x1b]0;<mock-chroot>\x07<mock-chroot>"', 'PATH': '/usr/bin:/bin:/usr/sbin:/sbin', 'HOME': '/builddir', 'HOSTNAME': 'mock'} and shell False
DEBUG util.py:515:  Child return code was: 0
DEBUG util.py:535:  child environment: None
DEBUG util.py:468:  Executing command: /usr/sbin/useradd -o -m -u 1006 -g 135 -d /builddir -n mockbuild with env {'LANG': 'en_GB.UTF-8', 'TERM': 'vt100', 'SHELL': '/bin/bash', 'PROMPT_COMMAND': 'printf "\x1b]0;<mock-chroot>\x07<mock-chroot>"', 'PATH': '/usr/bin:/bin:/usr/sbin:/sbin', 'HOME': '/builddir', 'HOSTNAME': 'mock'} and shell True
DEBUG util.py:515:  Child return code was: 0
DEBUG util.py:96:  ensuring that dir exists: /srv/build/7/aarch64-A/mock-root/c7-epel.a64-aarch64/root/builddir/build/RPMS
DEBUG util.py:99:  creating dir: /srv/build/7/aarch64-A/mock-root/c7-epel.a64-aarch64/root/builddir/build/RPMS
DEBUG util.py:96:  ensuring that dir exists: /srv/build/7/aarch64-A/mock-root/c7-epel.a64-aarch64/root/builddir/build/SPECS
DEBUG util.py:99:  creating dir: /srv/build/7/aarch64-A/mock-root/c7-epel.a64-aarch64/root/builddir/build/SPECS
DEBUG util.py:96:  ensuring that dir exists: /srv/build/7/aarch64-A/mock-root/c7-epel.a64-aarch64/root/builddir/build/SRPMS
DEBUG util.py:99:  creating dir: /srv/build/7/aarch64-A/mock-root/c7-epel.a64-aarch64/root/builddir/build/SRPMS
DEBUG util.py:96:  ensuring that dir exists: /srv/build/7/aarch64-A/mock-root/c7-epel.a64-aarch64/root/builddir/build/SOURCES
DEBUG util.py:99:  creating dir: /srv/build/7/aarch64-A/mock-root/c7-epel.a64-aarch64/root/builddir/build/SOURCES
DEBUG util.py:96:  ensuring that dir exists: /srv/build/7/aarch64-A/mock-root/c7-epel.a64-aarch64/root/builddir/build/BUILD
DEBUG util.py:99:  creating dir: /srv/build/7/aarch64-A/mock-root/c7-epel.a64-aarch64/root/builddir/build/BUILD
DEBUG util.py:96:  ensuring that dir exists: /srv/build/7/aarch64-A/mock-root/c7-epel.a64-aarch64/root/builddir/build/BUILDROOT
DEBUG util.py:99:  creating dir: /srv/build/7/aarch64-A/mock-root/c7-epel.a64-aarch64/root/builddir/build/BUILDROOT
DEBUG util.py:96:  ensuring that dir exists: /srv/build/7/aarch64-A/mock-root/c7-epel.a64-aarch64/root/builddir/build/originals
DEBUG util.py:99:  creating dir: /srv/build/7/aarch64-A/mock-root/c7-epel.a64-aarch64/root/builddir/build/originals
DEBUG util.py:108:  touching file: /srv/build/7/aarch64-A/mock-root/c7-epel.a64-aarch64/root/.initialized
INFO backend.py:167:  Installed packages:
DEBUG util.py:535:  child environment: None
DEBUG util.py:468:  Executing command: /bin/rpm --root /srv/build/7/aarch64-A/mock-root/c7-epel.a64-aarch64/root -qa with env {'LANG': 'en_GB.UTF-8', 'TERM': 'vt100', 'SHELL': '/bin/bash', 'HOSTNAME': 'mock', 'PROMPT_COMMAND': 'printf "\x1b]0;<mock-chroot>\x07<mock-chroot>"', 'HOME': '/builddir', 'PATH': '/usr/bin:/bin:/usr/sbin:/sbin'} and shell True
DEBUG util.py:393:  ncurses-base-5.9-13.20130511.el7.noarch
DEBUG util.py:393:  centos-release-7-2.1603.el7.centos.2.8.altarch.aarch64
DEBUG util.py:393:  filesystem-3.2-20.el7.aarch64
DEBUG util.py:393:  perl-srpm-macros-1-8.el7.noarch
DEBUG util.py:393:  nss-softokn-freebl-3.16.2.3-14.2.el7.centos.aarch64
DEBUG util.py:393:  glibc-2.17-106.el7.4.aarch64
DEBUG util.py:393:  libstdc++-4.8.5-4.el7.aarch64
DEBUG util.py:393:  bash-4.2.46-19.el7.aarch64
DEBUG util.py:393:  pcre-8.32-15.el7_2.1.aarch64
DEBUG util.py:393:  zlib-1.2.7-15.el7.aarch64
DEBUG util.py:393:  bzip2-libs-1.0.6-13.el7.aarch64
DEBUG util.py:393:  libdb-5.3.21-19.el7.aarch64
DEBUG util.py:393:  elfutils-libelf-0.163-3.el7.aarch64
DEBUG util.py:393:  popt-1.13-16.el7.aarch64
DEBUG util.py:393:  libattr-2.4.46-12.el7.aarch64
DEBUG util.py:393:  libcap-2.22-8.el7.aarch64
DEBUG util.py:393:  mpfr-3.1.1-4.el7.aarch64
DEBUG util.py:393:  libffi-3.0.13-16.el7.aarch64
DEBUG util.py:393:  audit-libs-2.4.1-5.el7.aarch64
DEBUG util.py:393:  chkconfig-1.3.61-5.el7_2.1.aarch64
DEBUG util.py:393:  file-libs-5.11-31.el7.aarch64
DEBUG util.py:393:  libcom_err-1.42.9-7.el7.aarch64
DEBUG util.py:393:  p11-kit-0.20.7-3.el7.aarch64
DEBUG util.py:393:  nss-softokn-3.16.2.3-14.2.el7.centos.aarch64
DEBUG util.py:393:  findutils-4.5.11-5.el7.aarch64
DEBUG util.py:393:  gawk-4.0.2-4.el7.aarch64
DEBUG util.py:393:  gdbm-1.10-8.el7.aarch64
DEBUG util.py:393:  file-5.11-31.el7.aarch64
DEBUG util.py:393:  cpp-4.8.5-4.el7.aarch64
DEBUG util.py:393:  groff-base-1.22.2-8.el7.aarch64
DEBUG util.py:393:  perl-HTTP-Tiny-0.033-3.el7.noarch
DEBUG util.py:393:  perl-Pod-Perldoc-3.20-4.el7.noarch
DEBUG util.py:393:  perl-Text-ParseWords-3.29-4.el7.noarch
DEBUG util.py:393:  perl-Pod-Usage-1.63-3.el7.noarch
DEBUG util.py:393:  perl-Socket-2.010-3.el7.aarch64
DEBUG util.py:393:  perl-File-Path-2.09-2.el7.noarch
DEBUG util.py:393:  perl-Scalar-List-Utils-1.27-248.el7.aarch64
DEBUG util.py:393:  perl-threads-shared-1.43-6.el7.aarch64
DEBUG util.py:393:  perl-Carp-1.26-244.el7.noarch
DEBUG util.py:393:  perl-Exporter-5.68-3.el7.noarch
DEBUG util.py:393:  perl-constant-1.27-2.el7.noarch
DEBUG util.py:393:  perl-Time-Local-1.2300-2.el7.noarch
DEBUG util.py:393:  perl-Getopt-Long-2.40-2.el7.noarch
DEBUG util.py:393:  perl-Thread-Queue-3.02-2.el7.noarch
DEBUG util.py:393:  patch-2.7.1-8.el7.aarch64
DEBUG util.py:393:  libdb-utils-5.3.21-19.el7.aarch64
DEBUG util.py:393:  bzip2-1.0.6-13.el7.aarch64
DEBUG util.py:393:  unzip-6.0-15.el7.centos.aarch64
DEBUG util.py:393:  cpio-2.11-24.el7.aarch64
DEBUG util.py:393:  libgomp-4.8.5-4.el7.aarch64
DEBUG util.py:393:  glib2-2.42.2-5.el7.aarch64
DEBUG util.py:393:  shared-mime-info-1.1-9.el7.aarch64
DEBUG util.py:393:  glibc-headers-2.17-106.el7.4.aarch64
DEBUG util.py:393:  gcc-4.8.5-4.el7.aarch64
DEBUG util.py:393:  libstdc++-devel-4.8.5-4.el7.aarch64
DEBUG util.py:393:  libtasn1-3.8-2.el7.aarch64
DEBUG util.py:393:  ustr-1.0.4-16.el7.aarch64
DEBUG util.py:393:  keyutils-libs-1.5.8-3.el7.aarch64
DEBUG util.py:393:  krb5-libs-1.13.2-12.el7_2.aarch64
DEBUG util.py:393:  coreutils-8.22-15.el7.1.aarch64
DEBUG util.py:393:  gzip-1.5-8.el7.aarch64
DEBUG util.py:393:  cracklib-dicts-2.9.0-11.el7.aarch64
DEBUG util.py:393:  libmount-2.23.2-26.el7_2.2.aarch64
DEBUG util.py:393:  pam-1.1.8-12.el7.1.aarch64
DEBUG util.py:393:  python-libs-2.7.5-34.el7.aarch64
DEBUG util.py:393:  shadow-utils-4.1.5.1-18.el7.aarch64
DEBUG util.py:393:  nss-3.21.0-9.el7.centos.aarch64
DEBUG util.py:393:  nss-tools-3.21.0-9.el7.centos.aarch64
DEBUG util.py:393:  libcurl-7.29.0-25.el7.aarch64
DEBUG util.py:393:  rpm-libs-4.11.3-17.el7.aarch64
DEBUG util.py:393:  openldap-2.4.40-9.el7_2.aarch64
DEBUG util.py:393:  rpm-build-libs-4.11.3-17.el7.aarch64
DEBUG util.py:393:  redhat-rpm-config-9.1.0-68.1.el7.centos.noarch
DEBUG util.py:393:  util-linux-2.23.2-26.el7_2.2.aarch64
DEBUG util.py:393:  gcc-c++-4.8.5-4.el7.aarch64
DEBUG util.py:393:  make-3.82-21.el7.aarch64
DEBUG util.py:393:  libgcc-4.8.5-4.el7.aarch64
DEBUG util.py:393:  kernel-headers-4.2.0-0.28.el7.1.aarch64
DEBUG util.py:393:  setup-2.8.71-6.el7.noarch
DEBUG util.py:393:  basesystem-10.0-7.el7.centos.noarch
DEBUG util.py:393:  tzdata-2016d-1.el7.noarch
DEBUG util.py:393:  glibc-common-2.17-106.el7.4.aarch64
DEBUG util.py:393:  xz-libs-5.1.2-12alpha.el7.aarch64
DEBUG util.py:393:  ncurses-libs-5.9-13.20130511.el7.aarch64
DEBUG util.py:393:  libsepol-2.1.9-3.el7.aarch64
DEBUG util.py:393:  libselinux-2.2.2-6.el7.aarch64
DEBUG util.py:393:  info-5.1-4.el7.aarch64
DEBUG util.py:393:  nspr-4.11.0-1.el7_2.aarch64
DEBUG util.py:393:  nss-util-3.21.0-2.2.el7_2.aarch64
DEBUG util.py:393:  gmp-6.0.0-12.el7.aarch64
DEBUG util.py:393:  readline-6.2-9.el7.aarch64
DEBUG util.py:393:  libacl-2.2.51-12.el7.aarch64
DEBUG util.py:393:  lua-5.1.4-14.el7.aarch64
DEBUG util.py:393:  sed-4.2.2-5.el7.aarch64
DEBUG util.py:393:  libgpg-error-1.12-3.el7.aarch64
DEBUG util.py:393:  libmpc-1.0.1-3.el7.aarch64
DEBUG util.py:393:  grep-2.20-2.el7.aarch64
DEBUG util.py:393:  libuuid-2.23.2-26.el7_2.2.aarch64
DEBUG util.py:393:  libgcrypt-1.5.3-12.el7.1.aarch64
DEBUG util.py:393:  sqlite-3.7.17-8.el7.aarch64
DEBUG util.py:393:  elfutils-libs-0.163-3.el7.aarch64
DEBUG util.py:393:  binutils-2.23.52.0.1-55.el7.aarch64
DEBUG util.py:393:  expat-2.1.0-8.el7.aarch64
DEBUG util.py:393:  elfutils-0.163-3.el7.aarch64
DEBUG util.py:393:  pinentry-0.8.1-14.el7.aarch64
DEBUG util.py:393:  libassuan-2.1.0-3.el7.aarch64
DEBUG util.py:393:  perl-parent-0.225-244.el7.noarch
DEBUG util.py:393:  perl-podlators-2.5.1-3.el7.noarch
DEBUG util.py:393:  perl-Pod-Escapes-1.04-286.el7.noarch
DEBUG util.py:393:  perl-Encode-2.51-7.el7.aarch64
DEBUG util.py:393:  perl-macros-5.16.3-286.el7.aarch64
DEBUG util.py:393:  perl-Storable-2.45-3.el7.aarch64
DEBUG util.py:393:  perl-PathTools-3.40-5.el7.aarch64
DEBUG util.py:393:  perl-Time-HiRes-1.9725-3.el7.aarch64
DEBUG util.py:393:  perl-threads-1.87-4.el7.aarch64
DEBUG util.py:393:  perl-Filter-1.49-3.el7.aarch64
DEBUG util.py:393:  perl-File-Temp-0.23.01-3.el7.noarch
DEBUG util.py:393:  perl-libs-5.16.3-286.el7.aarch64
DEBUG util.py:393:  perl-Pod-Simple-3.28-4.el7.noarch
DEBUG util.py:393:  perl-5.16.3-286.el7.aarch64
DEBUG util.py:393:  tar-1.26-29.el7.aarch64
DEBUG util.py:393:  dwz-0.11-3.el7.aarch64
DEBUG util.py:393:  cyrus-sasl-lib-2.1.26-20.el7.aarch64
DEBUG util.py:393:  zip-3.0-10.el7.aarch64
DEBUG util.py:393:  libidn-1.28-4.el7.aarch64
DEBUG util.py:393:  diffutils-3.3-4.el7.aarch64
DEBUG util.py:393:  libxml2-2.9.1-6.el7.2.aarch64
DEBUG util.py:393:  pkgconfig-0.27.1-4.el7.aarch64
DEBUG util.py:393:  xz-5.1.2-12alpha.el7.aarch64
DEBUG util.py:393:  glibc-devel-2.17-106.el7.4.aarch64
DEBUG util.py:393:  ncurses-5.9-13.20130511.el7.aarch64
DEBUG util.py:393:  pth-2.0.7-23.el7.aarch64
DEBUG util.py:393:  p11-kit-trust-0.20.7-3.el7.aarch64
DEBUG util.py:393:  libsemanage-2.1.10-18.el7.aarch64
DEBUG util.py:393:  libverto-0.2.5-4.el7.aarch64
DEBUG util.py:393:  openssl-libs-1.0.1e-51.el7.4.aarch64
DEBUG util.py:393:  ca-certificates-2015.2.6-70.1.el7_2.noarch
DEBUG util.py:393:  cracklib-2.9.0-11.el7.aarch64
DEBUG util.py:393:  libblkid-2.23.2-26.el7_2.2.aarch64
DEBUG util.py:393:  libpwquality-1.2.3-4.el7.aarch64
DEBUG util.py:393:  systemd-libs-219-19.el7.4.aarch64
DEBUG util.py:393:  gdb-7.6.1-80.el7.aarch64
DEBUG util.py:393:  libutempter-1.1.6-4.el7.aarch64
DEBUG util.py:393:  nss-sysinit-3.21.0-9.el7.centos.aarch64
DEBUG util.py:393:  libssh2-1.4.3-10.el7_2.1.aarch64
DEBUG util.py:393:  curl-7.29.0-25.el7.aarch64
DEBUG util.py:393:  rpm-4.11.3-17.el7.aarch64
DEBUG util.py:393:  gnupg2-2.0.22-3.el7.aarch64
DEBUG util.py:393:  libuser-0.60-7.el7.aarch64
DEBUG util.py:393:  libcap-ng-0.7.5-4.el7.aarch64
DEBUG util.py:393:  rpm-build-4.11.3-17.el7.aarch64
DEBUG util.py:393:  which-2.20-7.el7.aarch64
DEBUG util.py:515:  Child return code was: 0
DEBUG util.py:535:  child environment: None
DEBUG util.py:468:  Executing command: ['/bin/rpm', '-Uvh', '--nodeps', '/builddir/build/originals/josm-0-0.66.8109svn.el7.src.rpm'] with env {'LANG': 'en_GB.UTF-8', 'TERM': 'vt100', 'SHELL': '/bin/bash', 'PROMPT_COMMAND': 'printf "\x1b]0;<mock-chroot>\x07<mock-chroot>"', 'PATH': '/usr/bin:/bin:/usr/sbin:/sbin', 'HOME': '/builddir', 'HOSTNAME': 'mock'} and shell False
DEBUG util.py:393:  warning: /builddir/build/originals/josm-0-0.66.8109svn.el7.src.rpm: Header V3 RSA/SHA256 Signature, key ID 352c64e5: NOKEY
DEBUG util.py:393:  Updating / installing...
DEBUG util.py:393:  josm-0-0.66.8109svn.el7               ########################################
DEBUG util.py:515:  Child return code was: 0
DEBUG util.py:535:  child environment: None
DEBUG util.py:468:  Executing command: ['/bin/rpm', '-qpl', '/builddir/build/originals/josm-0-0.66.8109svn.el7.src.rpm'] with env {'LANG': 'en_GB.UTF-8', 'TERM': 'vt100', 'SHELL': '/bin/bash', 'PROMPT_COMMAND': 'printf "\x1b]0;<mock-chroot>\x07<mock-chroot>"', 'PATH': '/usr/bin:/bin:/usr/sbin:/sbin', 'HOME': '/builddir', 'HOSTNAME': 'mock'} and shell False
DEBUG util.py:393:  warning: /builddir/build/originals/josm-0-0.66.8109svn.el7.src.rpm: Header V3 RSA/SHA256 Signature, key ID 352c64e5: NOKEY
DEBUG util.py:393:  josm
DEBUG util.py:393:  josm-0-add_classpath.patch
DEBUG util.py:393:  josm-0-remove_svn_call.patch
DEBUG util.py:393:  josm-0.8109svn.tar.gz
DEBUG util.py:393:  josm-generate-tarball.sh
DEBUG util.py:393:  josm.spec
DEBUG util.py:515:  Child return code was: 0
DEBUG util.py:535:  child environment: None
DEBUG package_manager.py:92:  ['/usr/bin/yum-builddep', '--installroot', '/srv/build/7/aarch64-A/mock-root/c7-epel.a64-aarch64/root/', '/srv/build/7/aarch64-A/mock-root/c7-epel.a64-aarch64/root//builddir/build/SRPMS/josm-0-0.66.8109svn.el7.src.rpm']
DEBUG util.py:535:  child environment: None
DEBUG util.py:468:  Executing command: ['/usr/bin/yum-builddep', '--installroot', '/srv/build/7/aarch64-A/mock-root/c7-epel.a64-aarch64/root/', '/srv/build/7/aarch64-A/mock-root/c7-epel.a64-aarch64/root//builddir/build/SRPMS/josm-0-0.66.8109svn.el7.src.rpm', '--setopt=tsflags=nocontexts'] with env {'LANG': 'en_GB.UTF-8', 'TERM': 'vt100', 'SHELL': '/bin/bash', 'LC_MESSAGES': 'C', 'PROMPT_COMMAND': 'printf "\x1b]0;<mock-chroot>\x07<mock-chroot>"', 'PATH': '/usr/bin:/bin:/usr/sbin:/sbin', 'HOME': '/builddir', 'HOSTNAME': 'mock'} and shell False
DEBUG util.py:393:  Getting requirements for josm-0-0.66.8109svn.el7.src
DEBUG util.py:393:   --> javapackages-tools-3.4.1-11.el7.noarch
DEBUG util.py:393:   --> desktop-file-utils-0.22-1.el7.aarch64
DEBUG util.py:393:   --> ant-1.9.2-9.el7.noarch
DEBUG util.py:393:   --> 1:java-1.7.0-openjdk-devel-1.7.0.101-2.6.6.1.el7_2.aarch64
DEBUG util.py:393:   --> gettext-0.18.2.1-4.el7.aarch64
DEBUG util.py:393:   --> javacc-5.0-10.el7.noarch
DEBUG util.py:393:   --> signpost-core-1.2.1.2-7.el7.noarch
DEBUG util.py:393:   --> metadata-extractor2-2.8.1-2.el7.noarch
DEBUG util.py:393:   --> svgsalamander-0.1.29-1.el7.noarch
DEBUG util.py:393:   --> apache-commons-codec-1.8-7.el7.noarch
DEBUG util.py:393:   --> apache-commons-compress-1.5-4.el7.noarch
DEBUG util.py:393:   --> gnu-getopt-1.0.14-5.el7.noarch
DEBUG util.py:393:  ================================================================================
DEBUG util.py:393:   Package                 Arch    Version                   Repository      Size
DEBUG util.py:393:  ================================================================================
DEBUG util.py:393:  Installing:
DEBUG util.py:393:   ant                     noarch  1.9.2-9.el7               c7.1511.00.a64 1.9 M
DEBUG util.py:393:   apache-commons-codec    noarch  1.8-7.el7                 c7.1511.00.a64 223 k
DEBUG util.py:393:   apache-commons-compress noarch  1.5-4.el7                 c7.1511.00.a64 241 k
DEBUG util.py:393:   desktop-file-utils      aarch64 0.22-1.el7                c7.1511.00.a64  68 k
DEBUG util.py:393:   gettext                 aarch64 0.18.2.1-4.el7            c7.1511.00.a64 950 k
DEBUG util.py:393:   gnu-getopt              noarch  1.0.14-5.el7              c7.1511.00.a64  35 k
DEBUG util.py:393:   java-1.7.0-openjdk-devel
DEBUG util.py:393:                           aarch64 1:1.7.0.101-2.6.6.1.el7_2 c7.1511.u.a64  7.0 M
DEBUG util.py:393:   javacc                  noarch  5.0-10.el7                c7.1511.00.a64 298 k
DEBUG util.py:393:   javapackages-tools      noarch  3.4.1-11.el7              c7.1511.00.a64  73 k
DEBUG util.py:393:   metadata-extractor2     noarch  2.8.1-2.el7               c7-epel.a64    325 k
DEBUG util.py:393:   signpost-core           noarch  1.2.1.2-7.el7             c7-epel.a64     34 k
DEBUG util.py:393:   svgsalamander           noarch  0.1.29-1.el7              c7-epel.a64    338 k
DEBUG util.py:393:  Installing for dependencies:
DEBUG util.py:393:   GConf2                  aarch64 3.2.6-8.el7               c7.1511.00.a64 1.0 M
DEBUG util.py:393:   acl                     aarch64 2.2.51-12.el7             c7.1511.00.a64  81 k
DEBUG util.py:393:   alsa-lib                aarch64 1.0.28-2.el7              c7.1511.00.a64 359 k
DEBUG util.py:393:   atk                     aarch64 2.14.0-1.el7              c7.1511.00.a64 248 k
DEBUG util.py:393:   avahi-libs              aarch64 0.6.31-15.el7.1           c7.1511.00.a64  56 k
DEBUG util.py:393:   cairo                   aarch64 1.14.2-1.el7              c7.1511.00.a64 658 k
DEBUG util.py:393:   cryptsetup-libs         aarch64 1.6.7-1.el7               c7.1511.00.a64 177 k
DEBUG util.py:393:   cups-libs               aarch64 1:1.6.3-22.el7            c7.1511.00.a64 339 k
DEBUG util.py:393:   dbus                    aarch64 1:1.6.12-13.el7           c7.1511.00.a64 291 k
DEBUG util.py:393:   dbus-glib               aarch64 0.100-7.el7               c7.1511.00.a64  99 k
DEBUG util.py:393:   dbus-libs               aarch64 1:1.6.12-13.el7           c7.1511.00.a64 141 k
DEBUG util.py:393:   device-mapper           aarch64 7:1.02.107-5.el7_2.2      c7.1511.u.a64  246 k
DEBUG util.py:393:   device-mapper-libs      aarch64 7:1.02.107-5.el7_2.2      c7.1511.u.a64  286 k
DEBUG util.py:393:   dracut                  aarch64 033-360.el7               c7.1511.00.a64 310 k
DEBUG util.py:393:   emacs-filesystem        noarch  1:24.3-18.el7             c7.1511.00.a64  58 k
DEBUG util.py:393:   flac-libs               aarch64 1.3.0-5.el7.centos        c7.1511.00.a64 164 k
DEBUG util.py:393:   fontconfig              aarch64 2.10.95-7.el7             c7.1511.00.a64 224 k
DEBUG util.py:393:   fontpackages-filesystem noarch  1.44-8.el7                c7.1511.00.a64 9.9 k
DEBUG util.py:393:   freetype                aarch64 2.4.11-11.el7             c7.1511.00.a64 363 k
DEBUG util.py:393:   gdk-pixbuf2             aarch64 2.31.6-3.el7              c7.1511.00.a64 550 k
DEBUG util.py:393:   gettext-libs            aarch64 0.18.2.1-4.el7            c7.1511.00.a64 391 k
DEBUG util.py:393:   giflib                  aarch64 4.1.6-9.el7               c7.1511.00.a64  39 k
DEBUG util.py:393:   graphite2               aarch64 1.3.6-1.el7_2             c7.1511.u.a64  101 k
DEBUG util.py:393:   gsm                     aarch64 1.0.13-11.el7             c7.1511.00.a64  30 k
DEBUG util.py:393:   gtk2                    aarch64 2.24.28-8.el7             c7.1511.00.a64 3.2 M
DEBUG util.py:393:   hardlink                aarch64 1:1.0-19.el7              c7.1511.00.a64  14 k
DEBUG util.py:393:   harfbuzz                aarch64 0.9.36-1.el7              c7.1511.00.a64 144 k
DEBUG util.py:393:   hicolor-icon-theme      noarch  0.12-7.el7                c7.1511.00.a64  42 k
DEBUG util.py:393:   jasper-libs             aarch64 1.900.1-29.el7            c7.1511.00.a64 136 k
DEBUG util.py:393:   java-1.7.0-openjdk      aarch64 1:1.7.0.101-2.6.6.1.el7_2 c7.1511.u.a64  194 k
DEBUG util.py:393:   java-1.7.0-openjdk-headless
DEBUG util.py:393:                           aarch64 1:1.7.0.101-2.6.6.1.el7_2 c7.1511.u.a64   25 M
DEBUG util.py:393:   java-1.8.0-openjdk      aarch64 1:1.8.0.91-0.b14.el7_2    c7.1511.u.a64  207 k
DEBUG util.py:393:   java-1.8.0-openjdk-headless
DEBUG util.py:393:                           aarch64 1:1.8.0.91-0.b14.el7_2    c7.1511.u.a64   31 M
DEBUG util.py:393:   jbigkit-libs            aarch64 2.0-11.el7                c7.1511.00.a64  45 k
DEBUG util.py:393:   json-c                  aarch64 0.11-4.el7_0              c7.1511.u.a64   29 k
DEBUG util.py:393:   kmod                    aarch64 20-5.el7                  c7.1511.00.a64 111 k
DEBUG util.py:393:   kmod-libs               aarch64 20-5.el7                  c7.1511.00.a64  43 k
DEBUG util.py:393:   kpartx                  aarch64 0.4.9-85.el7_2.4          c7.1511.u.a64   59 k
DEBUG util.py:393:   libICE                  aarch64 1.0.9-2.el7               c7.1511.00.a64  62 k
DEBUG util.py:393:   libSM                   aarch64 1.2.2-2.el7               c7.1511.00.a64  38 k
DEBUG util.py:393:   libX11                  aarch64 1.6.3-2.el7               c7.1511.00.a64 579 k
DEBUG util.py:393:   libX11-common           noarch  1.6.3-2.el7               c7.1511.00.a64 162 k
DEBUG util.py:393:   libXau                  aarch64 1.0.8-2.1.el7             c7.1511.00.a64  29 k
DEBUG util.py:393:   libXcomposite           aarch64 0.4.4-4.1.el7             c7.1511.00.a64  22 k
DEBUG util.py:393:   libXcursor              aarch64 1.1.14-2.1.el7            c7.1511.00.a64  28 k
DEBUG util.py:393:   libXdamage              aarch64 1.1.4-4.1.el7             c7.1511.00.a64  20 k
DEBUG util.py:393:   libXext                 aarch64 1.3.3-3.el7               c7.1511.00.a64  37 k
DEBUG util.py:393:   libXfixes               aarch64 5.0.1-2.1.el7             c7.1511.00.a64  18 k
DEBUG util.py:393:   libXfont                aarch64 1.5.1-2.el7               c7.1511.00.a64 146 k
DEBUG util.py:393:   libXft                  aarch64 2.3.2-2.el7               c7.1511.00.a64  56 k
DEBUG util.py:393:   libXi                   aarch64 1.7.4-2.el7               c7.1511.00.a64  38 k
DEBUG util.py:393:   libXinerama             aarch64 1.1.3-2.1.el7             c7.1511.00.a64  13 k
DEBUG util.py:393:   libXrandr               aarch64 1.4.2-2.el7               c7.1511.00.a64  25 k
DEBUG util.py:393:   libXrender              aarch64 0.9.8-2.1.el7             c7.1511.00.a64  24 k
DEBUG util.py:393:   libXtst                 aarch64 1.2.2-2.1.el7             c7.1511.00.a64  20 k
DEBUG util.py:393:   libXxf86vm              aarch64 1.1.3-2.1.el7             c7.1511.00.a64  17 k
DEBUG util.py:393:   libasyncns              aarch64 0.8-7.el7                 c7.1511.00.a64  25 k
DEBUG util.py:393:   libcroco                aarch64 0.6.8-5.el7               c7.1511.00.a64  96 k
DEBUG util.py:393:   libdrm                  aarch64 2.4.60-3.el7              c7.1511.00.a64  75 k
DEBUG util.py:393:   libfontenc              aarch64 1.1.2-3.el7               c7.1511.00.a64  30 k
DEBUG util.py:393:   libjpeg-turbo           aarch64 1.2.90-5.el7              c7.1511.00.a64 117 k
DEBUG util.py:393:   libogg                  aarch64 2:1.3.0-7.el7             c7.1511.00.a64  23 k
DEBUG util.py:393:   libpng                  aarch64 2:1.5.13-7.el7            c7.1511.00.a64 206 k
DEBUG util.py:393:   libsndfile              aarch64 1.0.25-10.el7             c7.1511.00.a64 139 k
DEBUG util.py:393:   libthai                 aarch64 0.1.14-9.el7              c7.1511.00.a64 185 k
DEBUG util.py:393:   libtiff                 aarch64 4.0.3-14.el7              c7.1511.00.a64 155 k
DEBUG util.py:393:   libunistring            aarch64 0.9.3-9.el7               c7.1511.00.a64 279 k
DEBUG util.py:393:   libvorbis               aarch64 1:1.3.3-8.el7             c7.1511.00.a64 188 k
DEBUG util.py:393:   libxcb                  aarch64 1.11-4.el7                c7.1511.00.a64 186 k
DEBUG util.py:393:   libxshmfence            aarch64 1.2-1.el7                 c7.1511.00.a64 6.9 k
DEBUG util.py:393:   libxslt                 aarch64 1.1.28-5.el7              c7.1511.00.a64 227 k
DEBUG util.py:393:   lksctp-tools            aarch64 1.0.13-3.el7              c7.1511.00.a64  87 k
DEBUG util.py:393:   mesa-libEGL             aarch64 10.6.5-3.20150824.el7     c7.1511.00.a64  69 k
DEBUG util.py:393:   mesa-libGL              aarch64 10.6.5-3.20150824.el7     c7.1511.00.a64 180 k
DEBUG util.py:393:   mesa-libgbm             aarch64 10.6.5-3.20150824.el7     c7.1511.00.a64  39 k
DEBUG util.py:393:   mesa-libglapi           aarch64 10.6.5-3.20150824.el7     c7.1511.00.a64  47 k
DEBUG util.py:393:   mozjs17                 aarch64 17.0.0-12.el7.centos.0.1  c7.1511.u.a64  957 k
DEBUG util.py:393:   pango                   aarch64 1.36.8-2.el7              c7.1511.00.a64 277 k
DEBUG util.py:393:   pcsc-lite-libs          aarch64 1.8.8-6.el7               c7.1511.00.a64  33 k
DEBUG util.py:393:   pixman                  aarch64 0.32.6-3.el7              c7.1511.00.a64 144 k
DEBUG util.py:393:   polkit                  aarch64 0.112-6.el7               c7.1511.00.a64 160 k
DEBUG util.py:393:   polkit-pkla-compat      aarch64 0.1-4.el7                 c7.1511.00.a64  38 k
DEBUG util.py:393:   procps-ng               aarch64 3.3.10-5.el7              c7.1511.00.a64 286 k
DEBUG util.py:393:   psmisc                  aarch64 22.20-9.el7               c7.1511.00.a64 137 k
DEBUG util.py:393:   pulseaudio-libs         aarch64 6.0-7.el7                 c7.1511.00.a64 536 k
DEBUG util.py:393:   python                  aarch64 2.7.5-34.el7              c7.1511.00.a64  88 k
DEBUG util.py:393:   python-javapackages     noarch  3.4.1-11.el7              c7.1511.00.a64  31 k
DEBUG util.py:393:   python-lxml             aarch64 3.2.1-4.el7               c7.1511.00.a64 705 k
DEBUG util.py:393:   qrencode-libs           aarch64 3.4.1-3.el7               c7.1511.00.a64  48 k
DEBUG util.py:393:   systemd                 aarch64 219-19.el7.4              c7.1511.00.a64 4.7 M
DEBUG util.py:393:   tcp_wrappers-libs       aarch64 7.6-77.el7                c7.1511.00.a64  65 k
DEBUG util.py:393:   ttmkfdir                aarch64 3.0.9-42.el7              c7.1511.00.a64  47 k
DEBUG util.py:393:   tzdata-java             noarch  2016d-1.el7               c7.1511.u.a64  178 k
DEBUG util.py:393:   xalan-j2                noarch  2.7.1-23.el7              c7.1511.00.a64 1.9 M
DEBUG util.py:393:   xerces-j2               noarch  2.11.0-17.el7_0           c7.1511.00.a64 1.1 M
DEBUG util.py:393:   xml-commons-apis        noarch  1.4.01-16.el7             c7.1511.00.a64 227 k
DEBUG util.py:393:   xml-commons-resolver    noarch  1.2-15.el7                c7.1511.00.a64 108 k
DEBUG util.py:393:   xmpcore                 noarch  5.1.2-3.el7               c7-epel.a64    120 k
DEBUG util.py:393:   xorg-x11-font-utils     aarch64 1:7.5-20.el7              c7.1511.00.a64  87 k
DEBUG util.py:393:   xorg-x11-fonts-Type1    noarch  7.5-9.el7                 c7.1511.00.a64 521 k
DEBUG util.py:393:   xz-java                 noarch  1.3-3.el7                 c7.1511.00.a64  89 k
DEBUG util.py:393:  Transaction Summary
DEBUG util.py:393:  ================================================================================
DEBUG util.py:393:  Install  12 Packages (+101 Dependent packages)
DEBUG util.py:393:  Total download size: 93 M
DEBUG util.py:393:  Installed size: 339 M
DEBUG util.py:393:  Installed:
DEBUG util.py:393:    ant.noarch 0:1.9.2-9.el7                                                      
DEBUG util.py:393:    apache-commons-codec.noarch 0:1.8-7.el7                                       
DEBUG util.py:393:    apache-commons-compress.noarch 0:1.5-4.el7                                    
DEBUG util.py:393:    desktop-file-utils.aarch64 0:0.22-1.el7                                       
DEBUG util.py:393:    gettext.aarch64 0:0.18.2.1-4.el7                                              
DEBUG util.py:393:    gnu-getopt.noarch 0:1.0.14-5.el7                                              
DEBUG util.py:393:    java-1.7.0-openjdk-devel.aarch64 1:1.7.0.101-2.6.6.1.el7_2                    
DEBUG util.py:393:    javacc.noarch 0:5.0-10.el7                                                    
DEBUG util.py:393:    javapackages-tools.noarch 0:3.4.1-11.el7                                      
DEBUG util.py:393:    metadata-extractor2.noarch 0:2.8.1-2.el7                                      
DEBUG util.py:393:    signpost-core.noarch 0:1.2.1.2-7.el7                                          
DEBUG util.py:393:    svgsalamander.noarch 0:0.1.29-1.el7                                           
DEBUG util.py:393:  Dependency Installed:
DEBUG util.py:393:    GConf2.aarch64 0:3.2.6-8.el7                                                  
DEBUG util.py:393:    acl.aarch64 0:2.2.51-12.el7                                                   
DEBUG util.py:393:    alsa-lib.aarch64 0:1.0.28-2.el7                                               
DEBUG util.py:393:    atk.aarch64 0:2.14.0-1.el7                                                    
DEBUG util.py:393:    avahi-libs.aarch64 0:0.6.31-15.el7.1                                          
DEBUG util.py:393:    cairo.aarch64 0:1.14.2-1.el7                                                  
DEBUG util.py:393:    cryptsetup-libs.aarch64 0:1.6.7-1.el7                                         
DEBUG util.py:393:    cups-libs.aarch64 1:1.6.3-22.el7                                              
DEBUG util.py:393:    dbus.aarch64 1:1.6.12-13.el7                                                  
DEBUG util.py:393:    dbus-glib.aarch64 0:0.100-7.el7                                               
DEBUG util.py:393:    dbus-libs.aarch64 1:1.6.12-13.el7                                             
DEBUG util.py:393:    device-mapper.aarch64 7:1.02.107-5.el7_2.2                                    
DEBUG util.py:393:    device-mapper-libs.aarch64 7:1.02.107-5.el7_2.2                               
DEBUG util.py:393:    dracut.aarch64 0:033-360.el7                                                  
DEBUG util.py:393:    emacs-filesystem.noarch 1:24.3-18.el7                                         
DEBUG util.py:393:    flac-libs.aarch64 0:1.3.0-5.el7.centos                                        
DEBUG util.py:393:    fontconfig.aarch64 0:2.10.95-7.el7                                            
DEBUG util.py:393:    fontpackages-filesystem.noarch 0:1.44-8.el7                                   
DEBUG util.py:393:    freetype.aarch64 0:2.4.11-11.el7                                              
DEBUG util.py:393:    gdk-pixbuf2.aarch64 0:2.31.6-3.el7                                            
DEBUG util.py:393:    gettext-libs.aarch64 0:0.18.2.1-4.el7                                         
DEBUG util.py:393:    giflib.aarch64 0:4.1.6-9.el7                                                  
DEBUG util.py:393:    graphite2.aarch64 0:1.3.6-1.el7_2                                             
DEBUG util.py:393:    gsm.aarch64 0:1.0.13-11.el7                                                   
DEBUG util.py:393:    gtk2.aarch64 0:2.24.28-8.el7                                                  
DEBUG util.py:393:    hardlink.aarch64 1:1.0-19.el7                                                 
DEBUG util.py:393:    harfbuzz.aarch64 0:0.9.36-1.el7                                               
DEBUG util.py:393:    hicolor-icon-theme.noarch 0:0.12-7.el7                                        
DEBUG util.py:393:    jasper-libs.aarch64 0:1.900.1-29.el7                                          
DEBUG util.py:393:    java-1.7.0-openjdk.aarch64 1:1.7.0.101-2.6.6.1.el7_2                          
DEBUG util.py:393:    java-1.7.0-openjdk-headless.aarch64 1:1.7.0.101-2.6.6.1.el7_2                 
DEBUG util.py:393:    java-1.8.0-openjdk.aarch64 1:1.8.0.91-0.b14.el7_2                             
DEBUG util.py:393:    java-1.8.0-openjdk-headless.aarch64 1:1.8.0.91-0.b14.el7_2                    
DEBUG util.py:393:    jbigkit-libs.aarch64 0:2.0-11.el7                                             
DEBUG util.py:393:    json-c.aarch64 0:0.11-4.el7_0                                                 
DEBUG util.py:393:    kmod.aarch64 0:20-5.el7                                                       
DEBUG util.py:393:    kmod-libs.aarch64 0:20-5.el7                                                  
DEBUG util.py:393:    kpartx.aarch64 0:0.4.9-85.el7_2.4                                             
DEBUG util.py:393:    libICE.aarch64 0:1.0.9-2.el7                                                  
DEBUG util.py:393:    libSM.aarch64 0:1.2.2-2.el7                                                   
DEBUG util.py:393:    libX11.aarch64 0:1.6.3-2.el7                                                  
DEBUG util.py:393:    libX11-common.noarch 0:1.6.3-2.el7                                            
DEBUG util.py:393:    libXau.aarch64 0:1.0.8-2.1.el7                                                
DEBUG util.py:393:    libXcomposite.aarch64 0:0.4.4-4.1.el7                                         
DEBUG util.py:393:    libXcursor.aarch64 0:1.1.14-2.1.el7                                           
DEBUG util.py:393:    libXdamage.aarch64 0:1.1.4-4.1.el7                                            
DEBUG util.py:393:    libXext.aarch64 0:1.3.3-3.el7                                                 
DEBUG util.py:393:    libXfixes.aarch64 0:5.0.1-2.1.el7                                             
DEBUG util.py:393:    libXfont.aarch64 0:1.5.1-2.el7                                                
DEBUG util.py:393:    libXft.aarch64 0:2.3.2-2.el7                                                  
DEBUG util.py:393:    libXi.aarch64 0:1.7.4-2.el7                                                   
DEBUG util.py:393:    libXinerama.aarch64 0:1.1.3-2.1.el7                                           
DEBUG util.py:393:    libXrandr.aarch64 0:1.4.2-2.el7                                               
DEBUG util.py:393:    libXrender.aarch64 0:0.9.8-2.1.el7                                            
DEBUG util.py:393:    libXtst.aarch64 0:1.2.2-2.1.el7                                               
DEBUG util.py:393:    libXxf86vm.aarch64 0:1.1.3-2.1.el7                                            
DEBUG util.py:393:    libasyncns.aarch64 0:0.8-7.el7                                                
DEBUG util.py:393:    libcroco.aarch64 0:0.6.8-5.el7                                                
DEBUG util.py:393:    libdrm.aarch64 0:2.4.60-3.el7                                                 
DEBUG util.py:393:    libfontenc.aarch64 0:1.1.2-3.el7                                              
DEBUG util.py:393:    libjpeg-turbo.aarch64 0:1.2.90-5.el7                                          
DEBUG util.py:393:    libogg.aarch64 2:1.3.0-7.el7                                                  
DEBUG util.py:393:    libpng.aarch64 2:1.5.13-7.el7                                                 
DEBUG util.py:393:    libsndfile.aarch64 0:1.0.25-10.el7                                            
DEBUG util.py:393:    libthai.aarch64 0:0.1.14-9.el7                                                
DEBUG util.py:393:    libtiff.aarch64 0:4.0.3-14.el7                                                
DEBUG util.py:393:    libunistring.aarch64 0:0.9.3-9.el7                                            
DEBUG util.py:393:    libvorbis.aarch64 1:1.3.3-8.el7                                               
DEBUG util.py:393:    libxcb.aarch64 0:1.11-4.el7                                                   
DEBUG util.py:393:    libxshmfence.aarch64 0:1.2-1.el7                                              
DEBUG util.py:393:    libxslt.aarch64 0:1.1.28-5.el7                                                
DEBUG util.py:393:    lksctp-tools.aarch64 0:1.0.13-3.el7                                           
DEBUG util.py:393:    mesa-libEGL.aarch64 0:10.6.5-3.20150824.el7                                   
DEBUG util.py:393:    mesa-libGL.aarch64 0:10.6.5-3.20150824.el7                                    
DEBUG util.py:393:    mesa-libgbm.aarch64 0:10.6.5-3.20150824.el7                                   
DEBUG util.py:393:    mesa-libglapi.aarch64 0:10.6.5-3.20150824.el7                                 
DEBUG util.py:393:    mozjs17.aarch64 0:17.0.0-12.el7.centos.0.1                                    
DEBUG util.py:393:    pango.aarch64 0:1.36.8-2.el7                                                  
DEBUG util.py:393:    pcsc-lite-libs.aarch64 0:1.8.8-6.el7                                          
DEBUG util.py:393:    pixman.aarch64 0:0.32.6-3.el7                                                 
DEBUG util.py:393:    polkit.aarch64 0:0.112-6.el7                                                  
DEBUG util.py:393:    polkit-pkla-compat.aarch64 0:0.1-4.el7                                        
DEBUG util.py:393:    procps-ng.aarch64 0:3.3.10-5.el7                                              
DEBUG util.py:393:    psmisc.aarch64 0:22.20-9.el7                                                  
DEBUG util.py:393:    pulseaudio-libs.aarch64 0:6.0-7.el7                                           
DEBUG util.py:393:    python.aarch64 0:2.7.5-34.el7                                                 
DEBUG util.py:393:    python-javapackages.noarch 0:3.4.1-11.el7                                     
DEBUG util.py:393:    python-lxml.aarch64 0:3.2.1-4.el7                                             
DEBUG util.py:393:    qrencode-libs.aarch64 0:3.4.1-3.el7                                           
DEBUG util.py:393:    systemd.aarch64 0:219-19.el7.4                                                
DEBUG util.py:393:    tcp_wrappers-libs.aarch64 0:7.6-77.el7                                        
DEBUG util.py:393:    ttmkfdir.aarch64 0:3.0.9-42.el7                                               
DEBUG util.py:393:    tzdata-java.noarch 0:2016d-1.el7                                              
DEBUG util.py:393:    xalan-j2.noarch 0:2.7.1-23.el7                                                
DEBUG util.py:393:    xerces-j2.noarch 0:2.11.0-17.el7_0                                            
DEBUG util.py:393:    xml-commons-apis.noarch 0:1.4.01-16.el7                                       
DEBUG util.py:393:    xml-commons-resolver.noarch 0:1.2-15.el7                                      
DEBUG util.py:393:    xmpcore.noarch 0:5.1.2-3.el7                                                  
DEBUG util.py:393:    xorg-x11-font-utils.aarch64 1:7.5-20.el7                                      
DEBUG util.py:393:    xorg-x11-fonts-Type1.noarch 0:7.5-9.el7                                       
DEBUG util.py:393:    xz-java.noarch 0:1.3-3.el7                                                    
DEBUG util.py:515:  Child return code was: 0
DEBUG util.py:535:  child environment: None
DEBUG util.py:172:  kill orphans
DEBUG util.py:535:  child environment: None
DEBUG util.py:468:  Executing command: ['/bin/umount', '-n', '/srv/build/7/aarch64-A/mock-root/c7-epel.a64-aarch64/root/proc/filesystems'] with env {'LANG': 'en_GB.UTF-8', 'TERM': 'vt100', 'SHELL': '/bin/sh', 'HOSTNAME': 'mock', 'HOME': '/builddir', 'PATH': '/usr/bin:/bin:/usr/sbin:/sbin'} and shell False
DEBUG util.py:515:  Child return code was: 0
DEBUG util.py:535:  child environment: None
DEBUG util.py:468:  Executing command: ['/bin/umount', '-n', '-l', '/srv/build/7/aarch64-A/mock-root/c7-epel.a64-aarch64/root/dev/pts'] with env {'LANG': 'en_GB.UTF-8', 'TERM': 'vt100', 'SHELL': '/bin/sh', 'HOSTNAME': 'mock', 'HOME': '/builddir', 'PATH': '/usr/bin:/bin:/usr/sbin:/sbin'} and shell False
DEBUG util.py:515:  Child return code was: 0
DEBUG util.py:535:  child environment: None
DEBUG util.py:468:  Executing command: ['/bin/umount', '-n', '-l', '/srv/build/7/aarch64-A/mock-root/c7-epel.a64-aarch64/root/dev/shm'] with env {'LANG': 'en_GB.UTF-8', 'TERM': 'vt100', 'SHELL': '/bin/sh', 'HOSTNAME': 'mock', 'HOME': '/builddir', 'PATH': '/usr/bin:/bin:/usr/sbin:/sbin'} and shell False
DEBUG util.py:515:  Child return code was: 0
DEBUG util.py:535:  child environment: None
DEBUG util.py:468:  Executing command: ['/bin/umount', '-n', '-l', '/srv/build/7/aarch64-A/mock-root/c7-epel.a64-aarch64/root/sys'] with env {'LANG': 'en_GB.UTF-8', 'TERM': 'vt100', 'SHELL': '/bin/sh', 'HOSTNAME': 'mock', 'HOME': '/builddir', 'PATH': '/usr/bin:/bin:/usr/sbin:/sbin'} and shell False
DEBUG util.py:515:  Child return code was: 0
DEBUG util.py:535:  child environment: None
DEBUG util.py:468:  Executing command: ['/bin/umount', '-n', '-l', '/srv/build/7/aarch64-A/mock-root/c7-epel.a64-aarch64/root/proc'] with env {'LANG': 'en_GB.UTF-8', 'TERM': 'vt100', 'SHELL': '/bin/sh', 'HOSTNAME': 'mock', 'HOME': '/builddir', 'PATH': '/usr/bin:/bin:/usr/sbin:/sbin'} and shell False
DEBUG util.py:515:  Child return code was: 0
DEBUG util.py:535:  child environment: None
DEBUG util.py:468:  Executing command: ['btrfs', 'subv', 'list', '/srv/build/7/aarch64-A/mock-root'] with env {'LANG': 'en_GB.UTF-8', 'TERM': 'vt100', 'SHELL': '/bin/sh', 'HOSTNAME': 'mock', 'HOME': '/builddir', 'PATH': '/usr/bin:/bin:/usr/sbin:/sbin'} and shell False
DEBUG util.py:393:  ERROR: can't perform the search - Inappropriate ioctl for device
DEBUG util.py:393:  ERROR: can't get rootid for '/srv/build/7/aarch64-A/mock-root'
DEBUG util.py:515:  Child return code was: 1
---------------------------------------------
BUILD log: ----------------( last 500 lines )-----\n\n
  [javadoc] Loading source files for package org.openstreetmap.josm.io.auth...
  [javadoc] Loading source files for package org.openstreetmap.josm.io.imagery...
  [javadoc] Loading source files for package org.openstreetmap.josm.io.remotecontrol...
  [javadoc] Loading source files for package org.openstreetmap.josm.io.remotecontrol.handler...
  [javadoc] Loading source files for package org.openstreetmap.josm.io.session...
  [javadoc] Loading source files for package org.openstreetmap.josm.plugins...
  [javadoc] Loading source files for package org.openstreetmap.josm.tools...
  [javadoc] Loading source files for package org.openstreetmap.josm.tools.date...
  [javadoc] Loading source files for package org.openstreetmap.josm.tools.template_engine...
  [javadoc] Constructing Javadoc information...
  [javadoc] /builddir/build/BUILD/josm-0/src/org/openstreetmap/josm/gui/MainApplication.java:6: error: package gnu.getopt does not exist
  [javadoc] import gnu.getopt.Getopt;
  [javadoc]                  ^
  [javadoc] /builddir/build/BUILD/josm-0/src/org/openstreetmap/josm/gui/MainApplication.java:7: error: package gnu.getopt does not exist
  [javadoc] import gnu.getopt.LongOpt;
  [javadoc]                  ^
  [javadoc] /builddir/build/BUILD/josm-0/src/org/openstreetmap/josm/io/FileWatcher.java:22: error: package org.openstreetmap.josm.gui.mappaint.mapcss.parsergen does not exist
  [javadoc] import org.openstreetmap.josm.gui.mappaint.mapcss.parsergen.ParseException;
  [javadoc]                                                            ^
  [javadoc] /builddir/build/BUILD/josm-0/src/org/openstreetmap/josm/tools/ImageProvider.java:60: error: package org.apache.commons.codec.binary does not exist
  [javadoc] import org.apache.commons.codec.binary.Base64;
  [javadoc]                                       ^
  [javadoc] /builddir/build/BUILD/josm-0/src/org/openstreetmap/josm/tools/ImageProvider.java:76: error: package com.kitfox.svg does not exist
  [javadoc] import com.kitfox.svg.SVGDiagram;
  [javadoc]                      ^
  [javadoc] /builddir/build/BUILD/josm-0/src/org/openstreetmap/josm/tools/ImageProvider.java:77: error: package com.kitfox.svg does not exist
  [javadoc] import com.kitfox.svg.SVGUniverse;
  [javadoc]                      ^
  [javadoc] /builddir/build/BUILD/josm-0/src/org/openstreetmap/josm/tools/ImageProvider.java:184: error: cannot find symbol
  [javadoc]     private static SVGUniverse svgUniverse;
  [javadoc]                    ^
  [javadoc]   symbol:   class SVGUniverse
  [javadoc]   location: class ImageProvider
  [javadoc] /builddir/build/BUILD/josm-0/src/org/openstreetmap/josm/tools/ImageResource.java:15: error: package com.kitfox.svg does not exist
  [javadoc] import com.kitfox.svg.SVGDiagram;
  [javadoc]                      ^
  [javadoc] /builddir/build/BUILD/josm-0/src/org/openstreetmap/josm/tools/ImageProvider.java:1316: error: cannot find symbol
  [javadoc]     public static BufferedImage createImageFromSvg(SVGDiagram svg, Dimension dim) {
  [javadoc]                                                    ^
  [javadoc]   symbol:   class SVGDiagram
  [javadoc]   location: class ImageProvider
  [javadoc] /builddir/build/BUILD/josm-0/src/org/openstreetmap/josm/tools/ImageProvider.java:1358: error: cannot find symbol
  [javadoc]     private static SVGUniverse getSvgUniverse() {
  [javadoc]                    ^
  [javadoc]   symbol:   class SVGUniverse
  [javadoc]   location: class ImageProvider
  [javadoc] /builddir/build/BUILD/josm-0/src/org/openstreetmap/josm/tools/ImageResource.java:34: error: cannot find symbol
  [javadoc]     private SVGDiagram svg;
  [javadoc]             ^
  [javadoc]   symbol:   class SVGDiagram
  [javadoc]   location: class ImageResource
  [javadoc] /builddir/build/BUILD/josm-0/src/org/openstreetmap/josm/tools/ImageResource.java:59: error: cannot find symbol
  [javadoc]     public ImageResource(SVGDiagram svg) {
  [javadoc]                          ^
  [javadoc]   symbol:   class SVGDiagram
  [javadoc]   location: class ImageResource
  [javadoc] /builddir/build/BUILD/josm-0/src/org/openstreetmap/josm/io/OsmConnection.java:14: error: package oauth.signpost does not exist
  [javadoc] import oauth.signpost.OAuthConsumer;
  [javadoc]                      ^
  [javadoc] /builddir/build/BUILD/josm-0/src/org/openstreetmap/josm/io/OsmConnection.java:15: error: package oauth.signpost.exception does not exist
  [javadoc] import oauth.signpost.exception.OAuthException;
  [javadoc]                                ^
  [javadoc] /builddir/build/BUILD/josm-0/src/org/openstreetmap/josm/data/oauth/OAuthParameters.java:7: error: package oauth.signpost does not exist
  [javadoc] import oauth.signpost.OAuthConsumer;
  [javadoc]                      ^
  [javadoc] /builddir/build/BUILD/josm-0/src/org/openstreetmap/josm/data/oauth/OAuthParameters.java:8: error: package oauth.signpost does not exist
  [javadoc] import oauth.signpost.OAuthProvider;
  [javadoc]                      ^
  [javadoc] /builddir/build/BUILD/josm-0/src/org/openstreetmap/josm/data/oauth/OAuthParameters.java:9: error: package oauth.signpost.basic does not exist
  [javadoc] import oauth.signpost.basic.DefaultOAuthConsumer;
  [javadoc]                            ^
  [javadoc] /builddir/build/BUILD/josm-0/src/org/openstreetmap/josm/data/oauth/OAuthParameters.java:10: error: package oauth.signpost.basic does not exist
  [javadoc] import oauth.signpost.basic.DefaultOAuthProvider;
  [javadoc]                            ^
  [javadoc] /builddir/build/BUILD/josm-0/src/org/openstreetmap/josm/data/oauth/OAuthParameters.java:217: error: cannot find symbol
  [javadoc]     public OAuthConsumer buildConsumer() {
  [javadoc]            ^
  [javadoc]   symbol:   class OAuthConsumer
  [javadoc]   location: class OAuthParameters
  [javadoc] /builddir/build/BUILD/josm-0/src/org/openstreetmap/josm/data/oauth/OAuthParameters.java:228: error: cannot find symbol
  [javadoc]     public OAuthProvider buildProvider(OAuthConsumer consumer) throws IllegalArgumentException {
  [javadoc]                                        ^
  [javadoc]   symbol:   class OAuthConsumer
  [javadoc]   location: class OAuthParameters
  [javadoc] /builddir/build/BUILD/josm-0/src/org/openstreetmap/josm/data/oauth/OAuthParameters.java:228: error: cannot find symbol
  [javadoc]     public OAuthProvider buildProvider(OAuthConsumer consumer) throws IllegalArgumentException {
  [javadoc]            ^
  [javadoc]   symbol:   class OAuthProvider
  [javadoc]   location: class OAuthParameters
  [javadoc] /builddir/build/BUILD/josm-0/src/org/openstreetmap/josm/data/imagery/WmsCache.java:38: error: package org.openstreetmap.josm.data.imagery.types does not exist
  [javadoc] import org.openstreetmap.josm.data.imagery.types.EntryType;
  [javadoc]                                                 ^
  [javadoc] /builddir/build/BUILD/josm-0/src/org/openstreetmap/josm/data/imagery/WmsCache.java:39: error: package org.openstreetmap.josm.data.imagery.types does not exist
  [javadoc] import org.openstreetmap.josm.data.imagery.types.ProjectionType;
  [javadoc]                                                 ^
  [javadoc] /builddir/build/BUILD/josm-0/src/org/openstreetmap/josm/data/imagery/WmsCache.java:40: error: package org.openstreetmap.josm.data.imagery.types does not exist
  [javadoc] import org.openstreetmap.josm.data.imagery.types.WmsCacheType;
  [javadoc]                                                 ^
  [javadoc] /builddir/build/BUILD/josm-0/src/org/openstreetmap/josm/gui/layer/WMSLayer.java:53: error: package org.openstreetmap.josm.data.imagery.types does not exist
  [javadoc] import org.openstreetmap.josm.data.imagery.types.ObjectFactory;
  [javadoc]                                                 ^
  [javadoc] /builddir/build/BUILD/josm-0/src/org/openstreetmap/josm/gui/layer/WMSLayer.java:101: error: cannot find symbol
  [javadoc]     private static final ObjectFactory OBJECT_FACTORY = null;
  [javadoc]                          ^
  [javadoc]   symbol:   class ObjectFactory
  [javadoc]   location: class WMSLayer
  [javadoc] /builddir/build/BUILD/josm-0/src/org/openstreetmap/josm/data/oauth/OAuthToken.java:4: error: package oauth.signpost does not exist
  [javadoc] import oauth.signpost.OAuthConsumer;
  [javadoc]                      ^
  [javadoc] /builddir/build/BUILD/josm-0/src/org/openstreetmap/josm/data/oauth/OAuthToken.java:16: error: cannot find symbol
  [javadoc]     public static OAuthToken createToken(OAuthConsumer consumer) {
  [javadoc]                                          ^
  [javadoc]   symbol:   class OAuthConsumer
  [javadoc]   location: class OAuthToken
  [javadoc] /builddir/build/BUILD/josm-0/src/org/openstreetmap/josm/data/validation/tests/MapCSSTagChecker.java:54: error: package org.openstreetmap.josm.gui.mappaint.mapcss.parsergen does not exist
  [javadoc] import org.openstreetmap.josm.gui.mappaint.mapcss.parsergen.MapCSSParser;
  [javadoc]                                                            ^
  [javadoc] /builddir/build/BUILD/josm-0/src/org/openstreetmap/josm/data/validation/tests/MapCSSTagChecker.java:55: error: package org.openstreetmap.josm.gui.mappaint.mapcss.parsergen does not exist
  [javadoc] import org.openstreetmap.josm.gui.mappaint.mapcss.parsergen.ParseException;
  [javadoc]                                                            ^
  [javadoc] /builddir/build/BUILD/josm-0/src/org/openstreetmap/josm/data/validation/tests/MapCSSTagChecker.java:639: error: cannot find symbol
  [javadoc]     public synchronized void addMapCSS(String url) throws ParseException, IOException {
  [javadoc]                                                           ^
  [javadoc]   symbol:   class ParseException
  [javadoc]   location: class MapCSSTagChecker
  [javadoc] /builddir/build/BUILD/josm-0/src/org/openstreetmap/josm/tools/Utils.java:52: error: package org.apache.commons.compress.compressors.bzip2 does not exist
  [javadoc] import org.apache.commons.compress.compressors.bzip2.BZip2CompressorInputStream;
  [javadoc]                                                     ^
  [javadoc] /builddir/build/BUILD/josm-0/src/org/openstreetmap/josm/data/validation/tests/MapCSSTagChecker.java:279: error: cannot find symbol
  [javadoc]         static List<TagCheck> readMapCSS(Reader css) throws ParseException {
  [javadoc]                                                             ^
  [javadoc]   symbol:   class ParseException
  [javadoc]   location: class TagCheck
  [javadoc] /builddir/build/BUILD/josm-0/src/org/openstreetmap/josm/data/validation/tests/MapCSSTagChecker.java:284: error: cannot find symbol
  [javadoc]         static List<TagCheck> readMapCSS(MapCSSParser css) throws ParseException {
  [javadoc]                                          ^
  [javadoc]   symbol:   class MapCSSParser
  [javadoc]   location: class TagCheck
  [javadoc] /builddir/build/BUILD/josm-0/src/org/openstreetmap/josm/data/validation/tests/MapCSSTagChecker.java:284: error: cannot find symbol
  [javadoc]         static List<TagCheck> readMapCSS(MapCSSParser css) throws ParseException {
  [javadoc]                                                                   ^
  [javadoc]   symbol:   class ParseException
  [javadoc]   location: class TagCheck
  [javadoc] /builddir/build/BUILD/josm-0/src/org/openstreetmap/josm/gui/mappaint/mapcss/MapCSSStyleSource.java:47: error: package org.openstreetmap.josm.gui.mappaint.mapcss.parsergen does not exist
  [javadoc] import org.openstreetmap.josm.gui.mappaint.mapcss.parsergen.MapCSSParser;
  [javadoc]                                                            ^
  [javadoc] /builddir/build/BUILD/josm-0/src/org/openstreetmap/josm/gui/mappaint/mapcss/MapCSSStyleSource.java:48: error: package org.openstreetmap.josm.gui.mappaint.mapcss.parsergen does not exist
  [javadoc] import org.openstreetmap.josm.gui.mappaint.mapcss.parsergen.ParseException;
  [javadoc]                                                            ^
  [javadoc] /builddir/build/BUILD/josm-0/src/org/openstreetmap/josm/gui/mappaint/mapcss/MapCSSStyleSource.java:49: error: package org.openstreetmap.josm.gui.mappaint.mapcss.parsergen does not exist
  [javadoc] import org.openstreetmap.josm.gui.mappaint.mapcss.parsergen.TokenMgrError;
  [javadoc]                                                            ^
  [javadoc] /builddir/build/BUILD/josm-0/src/org/openstreetmap/josm/tools/Utils.java:760: error: cannot find symbol
  [javadoc]     public static BZip2CompressorInputStream getBZip2InputStream(InputStream in) throws IOException {
  [javadoc]                   ^
  [javadoc]   symbol:   class BZip2CompressorInputStream
  [javadoc]   location: class Utils
  [javadoc] /builddir/build/BUILD/josm-0/src/org/openstreetmap/josm/gui/layer/geoimage/GeoImageLayer.java:74: error: package com.drew.imaging.jpeg does not exist
  [javadoc] import com.drew.imaging.jpeg.JpegMetadataReader;
  [javadoc]                             ^
  [javadoc] /builddir/build/BUILD/josm-0/src/org/openstreetmap/josm/gui/layer/geoimage/GeoImageLayer.java:75: error: package com.drew.lang does not exist
  [javadoc] import com.drew.lang.CompoundException;
  [javadoc]                     ^
  [javadoc] /builddir/build/BUILD/josm-0/src/org/openstreetmap/josm/gui/layer/geoimage/GeoImageLayer.java:76: error: package com.drew.metadata does not exist
  [javadoc] import com.drew.metadata.Directory;
  [javadoc]                         ^
  [javadoc] /builddir/build/BUILD/josm-0/src/org/openstreetmap/josm/gui/layer/geoimage/GeoImageLayer.java:77: error: package com.drew.metadata does not exist
  [javadoc] import com.drew.metadata.Metadata;
  [javadoc]                         ^
  [javadoc] /builddir/build/BUILD/josm-0/src/org/openstreetmap/josm/gui/layer/geoimage/GeoImageLayer.java:78: error: package com.drew.metadata does not exist
  [javadoc] import com.drew.metadata.MetadataException;
  [javadoc]                         ^
  [javadoc] /builddir/build/BUILD/josm-0/src/org/openstreetmap/josm/gui/layer/geoimage/GeoImageLayer.java:79: error: package com.drew.metadata.exif does not exist
  [javadoc] import com.drew.metadata.exif.ExifIFD0Directory;
  [javadoc]                              ^
  [javadoc] /builddir/build/BUILD/josm-0/src/org/openstreetmap/josm/gui/layer/geoimage/GeoImageLayer.java:80: error: package com.drew.metadata.exif does not exist
  [javadoc] import com.drew.metadata.exif.GpsDirectory;
  [javadoc]                              ^
  [javadoc] /builddir/build/BUILD/josm-0/src/org/openstreetmap/josm/gui/oauth/OsmOAuthAuthorizationClient.java:26: error: package oauth.signpost does not exist
  [javadoc] import oauth.signpost.OAuth;
  [javadoc]                      ^
  [javadoc] /builddir/build/BUILD/josm-0/src/org/openstreetmap/josm/gui/oauth/OsmOAuthAuthorizationClient.java:27: error: package oauth.signpost does not exist
  [javadoc] import oauth.signpost.OAuthConsumer;
  [javadoc]                      ^
  [javadoc] /builddir/build/BUILD/josm-0/src/org/openstreetmap/josm/gui/oauth/OsmOAuthAuthorizationClient.java:28: error: package oauth.signpost does not exist
  [javadoc] import oauth.signpost.OAuthProvider;
  [javadoc]                      ^
  [javadoc] /builddir/build/BUILD/josm-0/src/org/openstreetmap/josm/gui/oauth/OsmOAuthAuthorizationClient.java:29: error: package oauth.signpost.basic does not exist
  [javadoc] import oauth.signpost.basic.DefaultOAuthProvider;
  [javadoc]                            ^
  [javadoc] /builddir/build/BUILD/josm-0/src/org/openstreetmap/josm/gui/oauth/OsmOAuthAuthorizationClient.java:30: error: package oauth.signpost.exception does not exist
  [javadoc] import oauth.signpost.exception.OAuthException;
  [javadoc]                                ^
  [javadoc] /builddir/build/BUILD/josm-0/src/org/openstreetmap/josm/gui/oauth/OsmOAuthAuthorizationClient.java:48: error: cannot find symbol
  [javadoc]     private final OAuthConsumer consumer;
  [javadoc]                   ^
  [javadoc]   symbol:   class OAuthConsumer
  [javadoc]   location: class OsmOAuthAuthorizationClient
  [javadoc] /builddir/build/BUILD/josm-0/src/org/openstreetmap/josm/gui/oauth/OsmOAuthAuthorizationClient.java:49: error: cannot find symbol
  [javadoc]     private final OAuthProvider provider;
  [javadoc]                   ^
  [javadoc]   symbol:   class OAuthProvider
  [javadoc]   location: class OsmOAuthAuthorizationClient
  [javadoc] /builddir/build/BUILD/josm-0/src/org/openstreetmap/josm/gui/oauth/TestAccessTokenTask.java:15: error: package oauth.signpost does not exist
  [javadoc] import oauth.signpost.OAuthConsumer;
  [javadoc]                      ^
  [javadoc] /builddir/build/BUILD/josm-0/src/org/openstreetmap/josm/gui/oauth/TestAccessTokenTask.java:16: error: package oauth.signpost.exception does not exist
  [javadoc] import oauth.signpost.exception.OAuthException;
  [javadoc]                                ^
  [javadoc] /builddir/build/BUILD/josm-0/src/org/openstreetmap/josm/gui/oauth/TestAccessTokenTask.java:82: error: cannot find symbol
  [javadoc]     protected void sign(HttpURLConnection con) throws OAuthException{
  [javadoc]                                                       ^
  [javadoc]   symbol:   class OAuthException
  [javadoc]   location: class TestAccessTokenTask
  [javadoc] /builddir/build/BUILD/josm-0/src/org/openstreetmap/josm/io/Compression.java:15: error: package org.apache.commons.compress.compressors.bzip2 does not exist
  [javadoc] import org.apache.commons.compress.compressors.bzip2.BZip2CompressorOutputStream;
  [javadoc]                                                     ^
  [javadoc] /builddir/build/BUILD/josm-0/src/org/openstreetmap/josm/io/remotecontrol/RemoteControlHttpsServer.java:44: warning: ObjectIdentifier is internal proprietary API and may be removed in a future release
  [javadoc] import sun.security.util.ObjectIdentifier;
  [javadoc]                         ^
  [javadoc] /builddir/build/BUILD/josm-0/src/org/openstreetmap/josm/io/remotecontrol/RemoteControlHttpsServer.java:45: warning: AlgorithmId is internal proprietary API and may be removed in a future release
  [javadoc] import sun.security.x509.AlgorithmId;
  [javadoc]                         ^
  [javadoc] /builddir/build/BUILD/josm-0/src/org/openstreetmap/josm/io/remotecontrol/RemoteControlHttpsServer.java:46: warning: BasicConstraintsExtension is internal proprietary API and may be removed in a future release
  [javadoc] import sun.security.x509.BasicConstraintsExtension;
  [javadoc]                         ^
  [javadoc] /builddir/build/BUILD/josm-0/src/org/openstreetmap/josm/io/remotecontrol/RemoteControlHttpsServer.java:47: warning: CertificateAlgorithmId is internal proprietary API and may be removed in a future release
  [javadoc] import sun.security.x509.CertificateAlgorithmId;
  [javadoc]                         ^
  [javadoc] /builddir/build/BUILD/josm-0/src/org/openstreetmap/josm/io/remotecontrol/RemoteControlHttpsServer.java:48: warning: CertificateExtensions is internal proprietary API and may be removed in a future release
  [javadoc] import sun.security.x509.CertificateExtensions;
  [javadoc]                         ^
  [javadoc] /builddir/build/BUILD/josm-0/src/org/openstreetmap/josm/io/remotecontrol/RemoteControlHttpsServer.java:49: warning: CertificateIssuerName is internal proprietary API and may be removed in a future release
  [javadoc] import sun.security.x509.CertificateIssuerName;
  [javadoc]                         ^
  [javadoc] /builddir/build/BUILD/josm-0/src/org/openstreetmap/josm/io/remotecontrol/RemoteControlHttpsServer.java:50: warning: CertificateSerialNumber is internal proprietary API and may be removed in a future release
  [javadoc] import sun.security.x509.CertificateSerialNumber;
  [javadoc]                         ^
  [javadoc] /builddir/build/BUILD/josm-0/src/org/openstreetmap/josm/io/remotecontrol/RemoteControlHttpsServer.java:51: warning: CertificateSubjectName is internal proprietary API and may be removed in a future release
  [javadoc] import sun.security.x509.CertificateSubjectName;
  [javadoc]                         ^
  [javadoc] /builddir/build/BUILD/josm-0/src/org/openstreetmap/josm/io/remotecontrol/RemoteControlHttpsServer.java:52: warning: CertificateValidity is internal proprietary API and may be removed in a future release
  [javadoc] import sun.security.x509.CertificateValidity;
  [javadoc]                         ^
  [javadoc] /builddir/build/BUILD/josm-0/src/org/openstreetmap/josm/io/remotecontrol/RemoteControlHttpsServer.java:53: warning: CertificateVersion is internal proprietary API and may be removed in a future release
  [javadoc] import sun.security.x509.CertificateVersion;
  [javadoc]                         ^
  [javadoc] /builddir/build/BUILD/josm-0/src/org/openstreetmap/josm/io/remotecontrol/RemoteControlHttpsServer.java:54: warning: CertificateX509Key is internal proprietary API and may be removed in a future release
  [javadoc] import sun.security.x509.CertificateX509Key;
  [javadoc]                         ^
  [javadoc] /builddir/build/BUILD/josm-0/src/org/openstreetmap/josm/io/remotecontrol/RemoteControlHttpsServer.java:55: warning: ExtendedKeyUsageExtension is internal proprietary API and may be removed in a future release
  [javadoc] import sun.security.x509.ExtendedKeyUsageExtension;
  [javadoc]                         ^
  [javadoc] /builddir/build/BUILD/josm-0/src/org/openstreetmap/josm/io/remotecontrol/RemoteControlHttpsServer.java:56: warning: GeneralName is internal proprietary API and may be removed in a future release
  [javadoc] import sun.security.x509.GeneralName;
  [javadoc]                         ^
  [javadoc] /builddir/build/BUILD/josm-0/src/org/openstreetmap/josm/io/remotecontrol/RemoteControlHttpsServer.java:57: warning: GeneralNameInterface is internal proprietary API and may be removed in a future release
  [javadoc] import sun.security.x509.GeneralNameInterface;
  [javadoc]                         ^
  [javadoc] /builddir/build/BUILD/josm-0/src/org/openstreetmap/josm/io/remotecontrol/RemoteControlHttpsServer.java:58: warning: GeneralNames is internal proprietary API and may be removed in a future release
  [javadoc] import sun.security.x509.GeneralNames;
  [javadoc]                         ^
  [javadoc] /builddir/build/BUILD/josm-0/src/org/openstreetmap/josm/io/remotecontrol/RemoteControlHttpsServer.java:59: warning: IPAddressName is internal proprietary API and may be removed in a future release
  [javadoc] import sun.security.x509.IPAddressName;
  [javadoc]                         ^
  [javadoc] /builddir/build/BUILD/josm-0/src/org/openstreetmap/josm/io/remotecontrol/RemoteControlHttpsServer.java:60: warning: OIDName is internal proprietary API and may be removed in a future release
  [javadoc] import sun.security.x509.OIDName;
  [javadoc]                         ^
  [javadoc] /builddir/build/BUILD/josm-0/src/org/openstreetmap/josm/io/remotecontrol/RemoteControlHttpsServer.java:61: warning: SubjectAlternativeNameExtension is internal proprietary API and may be removed in a future release
  [javadoc] import sun.security.x509.SubjectAlternativeNameExtension;
  [javadoc]                         ^
  [javadoc] /builddir/build/BUILD/josm-0/src/org/openstreetmap/josm/io/remotecontrol/RemoteControlHttpsServer.java:62: warning: URIName is internal proprietary API and may be removed in a future release
  [javadoc] import sun.security.x509.URIName;
  [javadoc]                         ^
  [javadoc] /builddir/build/BUILD/josm-0/src/org/openstreetmap/josm/io/remotecontrol/RemoteControlHttpsServer.java:63: warning: X500Name is internal proprietary API and may be removed in a future release
  [javadoc] import sun.security.x509.X500Name;
  [javadoc]                         ^
  [javadoc] /builddir/build/BUILD/josm-0/src/org/openstreetmap/josm/io/remotecontrol/RemoteControlHttpsServer.java:64: warning: X509CertImpl is internal proprietary API and may be removed in a future release
  [javadoc] import sun.security.x509.X509CertImpl;
  [javadoc]                         ^
  [javadoc] /builddir/build/BUILD/josm-0/src/org/openstreetmap/josm/io/remotecontrol/RemoteControlHttpsServer.java:65: warning: X509CertInfo is internal proprietary API and may be removed in a future release
  [javadoc] import sun.security.x509.X509CertInfo;
  [javadoc]                         ^
  [javadoc] /builddir/build/BUILD/josm-0/src/org/openstreetmap/josm/io/remotecontrol/DNSName.java:30: warning: DerOutputStream is internal proprietary API and may be removed in a future release
  [javadoc] import sun.security.util.DerOutputStream;
  [javadoc]                         ^
  [javadoc] /builddir/build/BUILD/josm-0/src/org/openstreetmap/josm/io/remotecontrol/DNSName.java:31: warning: GeneralNameInterface is internal proprietary API and may be removed in a future release
  [javadoc] import sun.security.x509.GeneralNameInterface;
  [javadoc]                         ^
  [javadoc] /builddir/build/BUILD/josm-0/src/org/openstreetmap/josm/io/remotecontrol/DNSName.java:59: warning: GeneralNameInterface is internal proprietary API and may be removed in a future release
  [javadoc] public class DNSName implements GeneralNameInterface {
  [javadoc]                                 ^
  [javadoc] /builddir/build/BUILD/josm-0/src/org/openstreetmap/josm/tools/ExifReader.java:13: error: package com.drew.imaging.jpeg does not exist
  [javadoc] import com.drew.imaging.jpeg.JpegMetadataReader;
  [javadoc]                             ^
  [javadoc] /builddir/build/BUILD/josm-0/src/org/openstreetmap/josm/tools/ExifReader.java:14: error: package com.drew.imaging.jpeg does not exist
  [javadoc] import com.drew.imaging.jpeg.JpegProcessingException;
  [javadoc]                             ^
  [javadoc] /builddir/build/BUILD/josm-0/src/org/openstreetmap/josm/tools/ExifReader.java:15: error: package com.drew.lang does not exist
  [javadoc] import com.drew.lang.Rational;
  [javadoc]                     ^
  [javadoc] /builddir/build/BUILD/josm-0/src/org/openstreetmap/josm/tools/ExifReader.java:16: error: package com.drew.metadata does not exist
  [javadoc] import com.drew.metadata.Directory;
  [javadoc]                         ^
  [javadoc] /builddir/build/BUILD/josm-0/src/org/openstreetmap/josm/tools/ExifReader.java:17: error: package com.drew.metadata does not exist
  [javadoc] import com.drew.metadata.Metadata;
  [javadoc]                         ^
  [javadoc] /builddir/build/BUILD/josm-0/src/org/openstreetmap/josm/tools/ExifReader.java:18: error: package com.drew.metadata does not exist
  [javadoc] import com.drew.metadata.MetadataException;
  [javadoc]                         ^
  [javadoc] /builddir/build/BUILD/josm-0/src/org/openstreetmap/josm/tools/ExifReader.java:19: error: package com.drew.metadata does not exist
  [javadoc] import com.drew.metadata.Tag;
  [javadoc]                         ^
  [javadoc] /builddir/build/BUILD/josm-0/src/org/openstreetmap/josm/tools/ExifReader.java:20: error: package com.drew.metadata.exif does not exist
  [javadoc] import com.drew.metadata.exif.ExifIFD0Directory;
  [javadoc]                              ^
  [javadoc] /builddir/build/BUILD/josm-0/src/org/openstreetmap/josm/tools/ExifReader.java:21: error: package com.drew.metadata.exif does not exist
  [javadoc] import com.drew.metadata.exif.ExifSubIFDDirectory;
  [javadoc]                              ^
  [javadoc] /builddir/build/BUILD/josm-0/src/org/openstreetmap/josm/tools/ExifReader.java:22: error: package com.drew.metadata.exif does not exist
  [javadoc] import com.drew.metadata.exif.GpsDirectory;
  [javadoc]                              ^
  [javadoc] /builddir/build/BUILD/josm-0/src/org/openstreetmap/josm/tools/ExifReader.java:125: error: cannot find symbol
  [javadoc]     public static LatLon readLatLon(GpsDirectory dirGps) throws MetadataException {
  [javadoc]                                     ^
  [javadoc]   symbol:   class GpsDirectory
  [javadoc]   location: class ExifReader
  [javadoc] /builddir/build/BUILD/josm-0/src/org/openstreetmap/josm/tools/ExifReader.java:125: error: cannot find symbol
  [javadoc]     public static LatLon readLatLon(GpsDirectory dirGps) throws MetadataException {
  [javadoc]                                                                 ^
  [javadoc]   symbol:   class MetadataException
  [javadoc]   location: class ExifReader
  [javadoc] /builddir/build/BUILD/josm-0/src/org/openstreetmap/josm/tools/ExifReader.java:159: error: cannot find symbol
  [javadoc]     public static Double readDirection(GpsDirectory dirGps) {
  [javadoc]                                        ^
  [javadoc]   symbol:   class GpsDirectory
  [javadoc]   location: class ExifReader
  [javadoc] /builddir/build/BUILD/josm-0/src/org/openstreetmap/josm/tools/ExifReader.java:169: error: cannot find symbol
  [javadoc]     private static double readAxis(GpsDirectory dirGps, int gpsTag, int gpsTagRef, char cRef) throws MetadataException  {
  [javadoc]                                    ^
  [javadoc]   symbol:   class GpsDirectory
  [javadoc]   location: class ExifReader
  [javadoc] /builddir/build/BUILD/josm-0/src/org/openstreetmap/josm/tools/ExifReader.java:169: error: cannot find symbol
  [javadoc]     private static double readAxis(GpsDirectory dirGps, int gpsTag, int gpsTagRef, char cRef) throws MetadataException  {
  [javadoc]                                                                                                      ^
  [javadoc]   symbol:   class MetadataException
  [javadoc]   location: class ExifReader
  [javadoc] Standard Doclet version 1.7.0_101
  [javadoc] Building tree for all the packages and classes...
  [javadoc] /builddir/build/BUILD/josm-0/src/org/openstreetmap/josm/data/oauth/OAuthParameters.java:217: warning - Tag @link: reference not found: OAuthConsumer
  [javadoc] /builddir/build/BUILD/josm-0/src/org/openstreetmap/josm/data/oauth/OAuthParameters.java:228: warning - Tag @link: reference not found: OAuthProvider
  [javadoc] /builddir/build/BUILD/josm-0/src/org/openstreetmap/josm/data/oauth/OAuthParameters.java:217: warning - Tag @link: reference not found: OAuthConsumer
  [javadoc] /builddir/build/BUILD/josm-0/src/org/openstreetmap/josm/data/oauth/OAuthParameters.java:228: warning - Tag @link: reference not found: OAuthProvider
  [javadoc] /builddir/build/BUILD/josm-0/src/org/openstreetmap/josm/data/oauth/OAuthToken.java:16: warning - Tag @link: reference not found: OAuthConsumer
  [javadoc] /builddir/build/BUILD/josm-0/src/org/openstreetmap/josm/data/oauth/OAuthToken.java:16: warning - Tag @link: reference not found: OAuthConsumer
  [javadoc] /builddir/build/BUILD/josm-0/src/org/openstreetmap/josm/gui/widgets/AbstractFileChooser.java:171: warning - @beaninfo is an unknown tag.
  [javadoc] /builddir/build/BUILD/josm-0/src/org/openstreetmap/josm/tools/Utils.java:737: warning - Tag @link: reference not found: BZip2CompressorInputStream
  [javadoc] /builddir/build/BUILD/josm-0/src/org/openstreetmap/josm/tools/Utils.java:836: warning - Tag @link: reference not found: BZip2CompressorInputStream
  [javadoc] /builddir/build/BUILD/josm-0/src/org/openstreetmap/josm/data/oauth/OAuthToken.java:16: warning - Tag @link: reference not found: OAuthConsumer
  [javadoc] Building index for all the packages and classes...
  [javadoc] /builddir/build/BUILD/josm-0/src/org/openstreetmap/josm/data/oauth/OAuthParameters.java:217: warning - Tag @link: reference not found: OAuthConsumer
  [javadoc] /builddir/build/BUILD/josm-0/src/org/openstreetmap/josm/data/oauth/OAuthParameters.java:228: warning - Tag @link: reference not found: OAuthProvider
  [javadoc] /builddir/build/BUILD/josm-0/src/org/openstreetmap/josm/data/oauth/OAuthToken.java:16: warning - Tag @link: reference not found: OAuthConsumer
  [javadoc] Building index for all classes...
  [javadoc] Generating /builddir/build/BUILD/josm-0/javadoc/help-doc.html...
  [javadoc] 110 warnings
BUILD SUCCESSFUL
Total time: 4 minutes 57 seconds
+ ant
Buildfile: /builddir/build/BUILD/josm-0/build.xml
init:
    [mkdir] Created dir: /builddir/build/BUILD/josm-0/build
    [mkdir] Created dir: /builddir/build/BUILD/josm-0/dist
javacc:
    [mkdir] Created dir: /builddir/build/BUILD/josm-0/src/org/openstreetmap/josm/gui/mappaint/mapcss/parsergen
     [exec] Java Compiler Compiler Version 5.0 (Parser Generator)
     [exec] (type "javacc" with no arguments for help)
     [exec] Warning: Line 4, Column 3: Command line setting of "OUTPUT_DIRECTORY" modifies option value in file.
     [exec] Reading from file /builddir/build/BUILD/josm-0/src/org/openstreetmap/josm/gui/mappaint/mapcss/MapCSSParser.jj . . .
     [exec] Warning: Line 137, Column 5: Non-ASCII characters used in regular expression.
     [exec] Please make sure you use the correct Reader when you create the parser, one that can handle your character set.
     [exec] File "TokenMgrError.java" does not exist.  Will create one.
     [exec] File "ParseException.java" does not exist.  Will create one.
     [exec] File "Token.java" does not exist.  Will create one.
     [exec] File "SimpleCharStream.java" does not exist.  Will create one.
     [exec] Parser generated with 0 errors and 2 warnings.
-jaxb_win:
-jaxb_nix:
jaxb:
     [exec] parsing a schema...
     [exec] compiling a schema...
     [exec] org/openstreetmap/josm/data/imagery/types/EntryType.java
     [exec] org/openstreetmap/josm/data/imagery/types/ObjectFactory.java
     [exec] org/openstreetmap/josm/data/imagery/types/ProjectionType.java
     [exec] org/openstreetmap/josm/data/imagery/types/WmsCacheType.java
     [exec] org/openstreetmap/josm/data/imagery/types/package-info.java
     [exec] org/w3/_2001/xmlschema/Adapter1.java
compile:
    [javac] Compiling 1267 source files to /builddir/build/BUILD/josm-0/build
    [javac] /builddir/build/BUILD/josm-0/src/org/openstreetmap/josm/gui/layer/geoimage/GeoImageLayer.java:605: error: cannot find symbol
    [javac]             dirExif = metadata.getDirectory(ExifIFD0Directory.class);
    [javac]                               ^
    [javac]   symbol:   method getDirectory(Class<ExifIFD0Directory>)
    [javac]   location: variable metadata of type Metadata
    [javac] /builddir/build/BUILD/josm-0/src/org/openstreetmap/josm/gui/layer/geoimage/GeoImageLayer.java:606: error: cannot find symbol
    [javac]             dirGps = metadata.getDirectory(GpsDirectory.class);
    [javac]                              ^
    [javac]   symbol:   method getDirectory(Class<GpsDirectory>)
    [javac]   location: variable metadata of type Metadata
    [javac] /builddir/build/BUILD/josm-0/src/org/openstreetmap/josm/gui/layer/geoimage/GeoImageLayer.java:629: error: cannot find symbol
    [javac]             double speed = dirGps.getDouble(GpsDirectory.TAG_GPS_SPEED);
    [javac]                                                         ^
    [javac]   symbol:   variable TAG_GPS_SPEED
    [javac]   location: class GpsDirectory
    [javac] /builddir/build/BUILD/josm-0/src/org/openstreetmap/josm/gui/layer/geoimage/GeoImageLayer.java:630: error: cannot find symbol
    [javac]             String speedRef = dirGps.getString(GpsDirectory.TAG_GPS_SPEED_REF);
    [javac]                                                            ^
    [javac]   symbol:   variable TAG_GPS_SPEED_REF
    [javac]   location: class GpsDirectory
    [javac] /builddir/build/BUILD/josm-0/src/org/openstreetmap/josm/gui/layer/geoimage/GeoImageLayer.java:647: error: cannot find symbol
    [javac]             double ele = dirGps.getDouble(GpsDirectory.TAG_GPS_ALTITUDE);
    [javac]                                                       ^
    [javac]   symbol:   variable TAG_GPS_ALTITUDE
    [javac]   location: class GpsDirectory
    [javac] /builddir/build/BUILD/josm-0/src/org/openstreetmap/josm/gui/layer/geoimage/GeoImageLayer.java:648: error: cannot find symbol
    [javac]             int d = dirGps.getInt(GpsDirectory.TAG_GPS_ALTITUDE_REF);
    [javac]                                               ^
    [javac]   symbol:   variable TAG_GPS_ALTITUDE_REF
    [javac]   location: class GpsDirectory
    [javac] /builddir/build/BUILD/josm-0/src/org/openstreetmap/josm/gui/layer/geoimage/GeoImageLayer.java:681: error: cannot find symbol
    [javac]         int[] timeStampComps = dirGps.getIntArray(GpsDirectory.TAG_GPS_TIME_STAMP);
    [javac]                                                               ^
    [javac]   symbol:   variable TAG_GPS_TIME_STAMP
    [javac]   location: class GpsDirectory
    [javac] /builddir/build/BUILD/josm-0/src/org/openstreetmap/josm/gui/layer/geoimage/GeoImageLayer.java:690: error: cannot find symbol
    [javac]             String dateStampStr = dirGps.getString(GpsDirectory.TAG_GPS_DATE_STAMP);
    [javac]                                                                ^
    [javac]   symbol:   variable TAG_GPS_DATE_STAMP
    [javac]   location: class GpsDirectory
    [javac] /builddir/build/BUILD/josm-0/src/org/openstreetmap/josm/tools/ExifReader.java:89: error: cannot find symbol
    [javac]             final Directory dir = metadata.getDirectory(ExifIFD0Directory.class);
    [javac]                                           ^
    [javac]   symbol:   method getDirectory(Class<ExifIFD0Directory>)
    [javac]   location: variable metadata of type Metadata
    [javac] /builddir/build/BUILD/josm-0/src/org/openstreetmap/josm/tools/ExifReader.java:106: error: cannot find symbol
    [javac]             final GpsDirectory dirGps = metadata.getDirectory(GpsDirectory.class);
    [javac]                                                 ^
    [javac]   symbol:   method getDirectory(Class<GpsDirectory>)
    [javac]   location: variable metadata of type Metadata
    [javac] /builddir/build/BUILD/josm-0/src/org/openstreetmap/josm/tools/ExifReader.java:127: error: cannot find symbol
    [javac]             double lat = readAxis(dirGps, GpsDirectory.TAG_GPS_LATITUDE, GpsDirectory.TAG_GPS_LATITUDE_REF, 'S');
    [javac]                                                       ^
    [javac]   symbol:   variable TAG_GPS_LATITUDE
    [javac]   location: class GpsDirectory
    [javac] /builddir/build/BUILD/josm-0/src/org/openstreetmap/josm/tools/ExifReader.java:127: error: cannot find symbol
    [javac]             double lat = readAxis(dirGps, GpsDirectory.TAG_GPS_LATITUDE, GpsDirectory.TAG_GPS_LATITUDE_REF, 'S');
    [javac]                                                                                      ^
    [javac]   symbol:   variable TAG_GPS_LATITUDE_REF
    [javac]   location: class GpsDirectory
    [javac] /builddir/build/BUILD/josm-0/src/org/openstreetmap/josm/tools/ExifReader.java:128: error: cannot find symbol
    [javac]             double lon = readAxis(dirGps, GpsDirectory.TAG_GPS_LONGITUDE, GpsDirectory.TAG_GPS_LONGITUDE_REF, 'W');
    [javac]                                                       ^
    [javac]   symbol:   variable TAG_GPS_LONGITUDE
    [javac]   location: class GpsDirectory
    [javac] /builddir/build/BUILD/josm-0/src/org/openstreetmap/josm/tools/ExifReader.java:128: error: cannot find symbol
    [javac]             double lon = readAxis(dirGps, GpsDirectory.TAG_GPS_LONGITUDE, GpsDirectory.TAG_GPS_LONGITUDE_REF, 'W');
    [javac]                                                                                       ^
    [javac]   symbol:   variable TAG_GPS_LONGITUDE_REF
    [javac]   location: class GpsDirectory
    [javac] /builddir/build/BUILD/josm-0/src/org/openstreetmap/josm/tools/ExifReader.java:143: error: cannot find symbol
    [javac]             final GpsDirectory dirGps = metadata.getDirectory(GpsDirectory.class);
    [javac]                                                 ^
    [javac]   symbol:   method getDirectory(Class<GpsDirectory>)
    [javac]   location: variable metadata of type Metadata
    [javac] /builddir/build/BUILD/josm-0/src/org/openstreetmap/josm/tools/ExifReader.java:161: error: cannot find symbol
    [javac]             Rational direction = dirGps.getRational(GpsDirectory.TAG_GPS_IMG_DIRECTION);
    [javac]                                                                 ^
    [javac]   symbol:   variable TAG_GPS_IMG_DIRECTION
    [javac]   location: class GpsDirectory
    [javac] Note: Some input files use or override a deprecated API.
    [javac] Note: Recompile with -Xlint:deprecation for details.
    [javac] 16 errors
BUILD FAILED
/builddir/build/BUILD/josm-0/build.xml:219: Compile failed; see the compiler error output for details.
Total time: 29 seconds
error: Bad exit status from /var/tmp/rpm-tmp.Yiu56I (%build)
    Bad exit status from /var/tmp/rpm-tmp.Yiu56I (%build)
RPM build errors:
Child return code was: 1
EXCEPTION: Command failed. See logs for output.
 # bash --login -c /usr/bin/rpmbuild -bb --target aarch64 --nodeps  /builddir/build/SPECS/josm.spec 
Traceback (most recent call last):
  File "/usr/lib/python2.7/site-packages/mockbuild/trace_decorator.py", line 84, in trace
    result = func(*args, **kw)
  File "/usr/lib/python2.7/site-packages/mockbuild/util.py", line 520, in do
    raise exception.Error("Command failed. See logs for output.\n # %s" % (command,), child.returncode)
Error: Command failed. See logs for output.
 # bash --login -c /usr/bin/rpmbuild -bb --target aarch64 --nodeps  /builddir/build/SPECS/josm.spec 
LEAVE do --> EXCEPTION RAISED



More information about the CentOS-build-reports mailing list