[CentOS-build-reports] Build Fail: xfce4-battery-plugin 1.0.5-7.el7.aarch64 on c7-epel.a64

buildsys at centos.org buildsys at centos.org
Wed Jun 22 12:02:12 UTC 2016


ROOT log: -----------------( last 500 lines )-----\n\n
DEBUG util.py:99:  creating dir: /srv/build/7/aarch64-C/mock-root/c7-epel.a64-aarch64/root/builddir/build/RPMS
DEBUG util.py:96:  ensuring that dir exists: /srv/build/7/aarch64-C/mock-root/c7-epel.a64-aarch64/root/builddir/build/SPECS
DEBUG util.py:99:  creating dir: /srv/build/7/aarch64-C/mock-root/c7-epel.a64-aarch64/root/builddir/build/SPECS
DEBUG util.py:96:  ensuring that dir exists: /srv/build/7/aarch64-C/mock-root/c7-epel.a64-aarch64/root/builddir/build/SRPMS
DEBUG util.py:99:  creating dir: /srv/build/7/aarch64-C/mock-root/c7-epel.a64-aarch64/root/builddir/build/SRPMS
DEBUG util.py:96:  ensuring that dir exists: /srv/build/7/aarch64-C/mock-root/c7-epel.a64-aarch64/root/builddir/build/SOURCES
DEBUG util.py:99:  creating dir: /srv/build/7/aarch64-C/mock-root/c7-epel.a64-aarch64/root/builddir/build/SOURCES
DEBUG util.py:96:  ensuring that dir exists: /srv/build/7/aarch64-C/mock-root/c7-epel.a64-aarch64/root/builddir/build/BUILD
DEBUG util.py:99:  creating dir: /srv/build/7/aarch64-C/mock-root/c7-epel.a64-aarch64/root/builddir/build/BUILD
DEBUG util.py:96:  ensuring that dir exists: /srv/build/7/aarch64-C/mock-root/c7-epel.a64-aarch64/root/builddir/build/BUILDROOT
DEBUG util.py:99:  creating dir: /srv/build/7/aarch64-C/mock-root/c7-epel.a64-aarch64/root/builddir/build/BUILDROOT
DEBUG util.py:96:  ensuring that dir exists: /srv/build/7/aarch64-C/mock-root/c7-epel.a64-aarch64/root/builddir/build/originals
DEBUG util.py:99:  creating dir: /srv/build/7/aarch64-C/mock-root/c7-epel.a64-aarch64/root/builddir/build/originals
DEBUG util.py:108:  touching file: /srv/build/7/aarch64-C/mock-root/c7-epel.a64-aarch64/root/.initialized
INFO backend.py:167:  Installed packages:
DEBUG util.py:535:  child environment: None
DEBUG util.py:468:  Executing command: /bin/rpm --root /srv/build/7/aarch64-C/mock-root/c7-epel.a64-aarch64/root -qa with env {'LANG': 'en_GB.UTF-8', 'TERM': 'vt100', 'SHELL': '/bin/bash', 'HOSTNAME': 'mock', 'PROMPT_COMMAND': 'printf "\x1b]0;<mock-chroot>\x07<mock-chroot>"', 'HOME': '/builddir', 'PATH': '/usr/bin:/bin:/usr/sbin:/sbin'} and shell True
DEBUG util.py:393:  ncurses-base-5.9-13.20130511.el7.noarch
DEBUG util.py:393:  centos-release-7-2.1603.el7.centos.2.8.altarch.aarch64
DEBUG util.py:393:  filesystem-3.2-20.el7.aarch64
DEBUG util.py:393:  perl-srpm-macros-1-8.el7.noarch
DEBUG util.py:393:  nss-softokn-freebl-3.16.2.3-14.2.el7.centos.aarch64
DEBUG util.py:393:  glibc-2.17-106.el7.4.aarch64
DEBUG util.py:393:  libstdc++-4.8.5-4.el7.aarch64
DEBUG util.py:393:  bash-4.2.46-19.el7.aarch64
DEBUG util.py:393:  pcre-8.32-15.el7_2.1.aarch64
DEBUG util.py:393:  zlib-1.2.7-15.el7.aarch64
DEBUG util.py:393:  bzip2-libs-1.0.6-13.el7.aarch64
DEBUG util.py:393:  libdb-5.3.21-19.el7.aarch64
DEBUG util.py:393:  elfutils-libelf-0.163-3.el7.aarch64
DEBUG util.py:393:  popt-1.13-16.el7.aarch64
DEBUG util.py:393:  libattr-2.4.46-12.el7.aarch64
DEBUG util.py:393:  libcap-2.22-8.el7.aarch64
DEBUG util.py:393:  mpfr-3.1.1-4.el7.aarch64
DEBUG util.py:393:  libffi-3.0.13-16.el7.aarch64
DEBUG util.py:393:  audit-libs-2.4.1-5.el7.aarch64
DEBUG util.py:393:  chkconfig-1.3.61-5.el7_2.1.aarch64
DEBUG util.py:393:  file-libs-5.11-31.el7.aarch64
DEBUG util.py:393:  libcom_err-1.42.9-7.el7.aarch64
DEBUG util.py:393:  p11-kit-0.20.7-3.el7.aarch64
DEBUG util.py:393:  nss-softokn-3.16.2.3-14.2.el7.centos.aarch64
DEBUG util.py:393:  findutils-4.5.11-5.el7.aarch64
DEBUG util.py:393:  gawk-4.0.2-4.el7.aarch64
DEBUG util.py:393:  gdbm-1.10-8.el7.aarch64
DEBUG util.py:393:  file-5.11-31.el7.aarch64
DEBUG util.py:393:  cpp-4.8.5-4.el7.aarch64
DEBUG util.py:393:  groff-base-1.22.2-8.el7.aarch64
DEBUG util.py:393:  perl-HTTP-Tiny-0.033-3.el7.noarch
DEBUG util.py:393:  perl-Pod-Perldoc-3.20-4.el7.noarch
DEBUG util.py:393:  perl-Text-ParseWords-3.29-4.el7.noarch
DEBUG util.py:393:  perl-Pod-Usage-1.63-3.el7.noarch
DEBUG util.py:393:  perl-Socket-2.010-3.el7.aarch64
DEBUG util.py:393:  perl-File-Path-2.09-2.el7.noarch
DEBUG util.py:393:  perl-Scalar-List-Utils-1.27-248.el7.aarch64
DEBUG util.py:393:  perl-threads-shared-1.43-6.el7.aarch64
DEBUG util.py:393:  perl-Carp-1.26-244.el7.noarch
DEBUG util.py:393:  perl-Exporter-5.68-3.el7.noarch
DEBUG util.py:393:  perl-constant-1.27-2.el7.noarch
DEBUG util.py:393:  perl-Time-Local-1.2300-2.el7.noarch
DEBUG util.py:393:  perl-Getopt-Long-2.40-2.el7.noarch
DEBUG util.py:393:  perl-Thread-Queue-3.02-2.el7.noarch
DEBUG util.py:393:  patch-2.7.1-8.el7.aarch64
DEBUG util.py:393:  libdb-utils-5.3.21-19.el7.aarch64
DEBUG util.py:393:  bzip2-1.0.6-13.el7.aarch64
DEBUG util.py:393:  unzip-6.0-15.el7.centos.aarch64
DEBUG util.py:393:  cpio-2.11-24.el7.aarch64
DEBUG util.py:393:  libgomp-4.8.5-4.el7.aarch64
DEBUG util.py:393:  glib2-2.42.2-5.el7.aarch64
DEBUG util.py:393:  shared-mime-info-1.1-9.el7.aarch64
DEBUG util.py:393:  glibc-headers-2.17-106.el7.4.aarch64
DEBUG util.py:393:  gcc-4.8.5-4.el7.aarch64
DEBUG util.py:393:  libstdc++-devel-4.8.5-4.el7.aarch64
DEBUG util.py:393:  libtasn1-3.8-2.el7.aarch64
DEBUG util.py:393:  ustr-1.0.4-16.el7.aarch64
DEBUG util.py:393:  keyutils-libs-1.5.8-3.el7.aarch64
DEBUG util.py:393:  krb5-libs-1.13.2-12.el7_2.aarch64
DEBUG util.py:393:  coreutils-8.22-15.el7.1.aarch64
DEBUG util.py:393:  gzip-1.5-8.el7.aarch64
DEBUG util.py:393:  cracklib-dicts-2.9.0-11.el7.aarch64
DEBUG util.py:393:  libmount-2.23.2-26.el7_2.2.aarch64
DEBUG util.py:393:  pam-1.1.8-12.el7.1.aarch64
DEBUG util.py:393:  python-libs-2.7.5-34.el7.aarch64
DEBUG util.py:393:  shadow-utils-4.1.5.1-18.el7.aarch64
DEBUG util.py:393:  nss-3.21.0-9.el7.centos.aarch64
DEBUG util.py:393:  nss-tools-3.21.0-9.el7.centos.aarch64
DEBUG util.py:393:  libcurl-7.29.0-25.el7.aarch64
DEBUG util.py:393:  rpm-libs-4.11.3-17.el7.aarch64
DEBUG util.py:393:  openldap-2.4.40-9.el7_2.aarch64
DEBUG util.py:393:  rpm-build-libs-4.11.3-17.el7.aarch64
DEBUG util.py:393:  redhat-rpm-config-9.1.0-68.1.el7.centos.noarch
DEBUG util.py:393:  util-linux-2.23.2-26.el7_2.2.aarch64
DEBUG util.py:393:  gcc-c++-4.8.5-4.el7.aarch64
DEBUG util.py:393:  make-3.82-21.el7.aarch64
DEBUG util.py:393:  libgcc-4.8.5-4.el7.aarch64
DEBUG util.py:393:  kernel-headers-4.2.0-0.28.el7.1.aarch64
DEBUG util.py:393:  setup-2.8.71-6.el7.noarch
DEBUG util.py:393:  basesystem-10.0-7.el7.centos.noarch
DEBUG util.py:393:  tzdata-2016e-1.el7.noarch
DEBUG util.py:393:  glibc-common-2.17-106.el7.4.aarch64
DEBUG util.py:393:  xz-libs-5.1.2-12alpha.el7.aarch64
DEBUG util.py:393:  ncurses-libs-5.9-13.20130511.el7.aarch64
DEBUG util.py:393:  libsepol-2.1.9-3.el7.aarch64
DEBUG util.py:393:  libselinux-2.2.2-6.el7.aarch64
DEBUG util.py:393:  info-5.1-4.el7.aarch64
DEBUG util.py:393:  nspr-4.11.0-1.el7_2.aarch64
DEBUG util.py:393:  nss-util-3.21.0-2.2.el7_2.aarch64
DEBUG util.py:393:  gmp-6.0.0-12.el7.aarch64
DEBUG util.py:393:  readline-6.2-9.el7.aarch64
DEBUG util.py:393:  libacl-2.2.51-12.el7.aarch64
DEBUG util.py:393:  lua-5.1.4-14.el7.aarch64
DEBUG util.py:393:  sed-4.2.2-5.el7.aarch64
DEBUG util.py:393:  libgpg-error-1.12-3.el7.aarch64
DEBUG util.py:393:  libmpc-1.0.1-3.el7.aarch64
DEBUG util.py:393:  grep-2.20-2.el7.aarch64
DEBUG util.py:393:  libuuid-2.23.2-26.el7_2.2.aarch64
DEBUG util.py:393:  libgcrypt-1.5.3-12.el7.1.aarch64
DEBUG util.py:393:  sqlite-3.7.17-8.el7.aarch64
DEBUG util.py:393:  elfutils-libs-0.163-3.el7.aarch64
DEBUG util.py:393:  binutils-2.23.52.0.1-55.el7.aarch64
DEBUG util.py:393:  expat-2.1.0-8.el7.aarch64
DEBUG util.py:393:  elfutils-0.163-3.el7.aarch64
DEBUG util.py:393:  pinentry-0.8.1-14.el7.aarch64
DEBUG util.py:393:  libassuan-2.1.0-3.el7.aarch64
DEBUG util.py:393:  perl-parent-0.225-244.el7.noarch
DEBUG util.py:393:  perl-podlators-2.5.1-3.el7.noarch
DEBUG util.py:393:  perl-Pod-Escapes-1.04-286.el7.noarch
DEBUG util.py:393:  perl-Encode-2.51-7.el7.aarch64
DEBUG util.py:393:  perl-macros-5.16.3-286.el7.aarch64
DEBUG util.py:393:  perl-Storable-2.45-3.el7.aarch64
DEBUG util.py:393:  perl-PathTools-3.40-5.el7.aarch64
DEBUG util.py:393:  perl-Time-HiRes-1.9725-3.el7.aarch64
DEBUG util.py:393:  perl-threads-1.87-4.el7.aarch64
DEBUG util.py:393:  perl-Filter-1.49-3.el7.aarch64
DEBUG util.py:393:  perl-File-Temp-0.23.01-3.el7.noarch
DEBUG util.py:393:  perl-libs-5.16.3-286.el7.aarch64
DEBUG util.py:393:  perl-Pod-Simple-3.28-4.el7.noarch
DEBUG util.py:393:  perl-5.16.3-286.el7.aarch64
DEBUG util.py:393:  tar-1.26-29.el7.aarch64
DEBUG util.py:393:  dwz-0.11-3.el7.aarch64
DEBUG util.py:393:  cyrus-sasl-lib-2.1.26-20.el7.aarch64
DEBUG util.py:393:  zip-3.0-10.el7.aarch64
DEBUG util.py:393:  libidn-1.28-4.el7.aarch64
DEBUG util.py:393:  diffutils-3.3-4.el7.aarch64
DEBUG util.py:393:  libxml2-2.9.1-6.el7.2.aarch64
DEBUG util.py:393:  pkgconfig-0.27.1-4.el7.aarch64
DEBUG util.py:393:  xz-5.1.2-12alpha.el7.aarch64
DEBUG util.py:393:  glibc-devel-2.17-106.el7.4.aarch64
DEBUG util.py:393:  ncurses-5.9-13.20130511.el7.aarch64
DEBUG util.py:393:  pth-2.0.7-23.el7.aarch64
DEBUG util.py:393:  p11-kit-trust-0.20.7-3.el7.aarch64
DEBUG util.py:393:  libsemanage-2.1.10-18.el7.aarch64
DEBUG util.py:393:  libverto-0.2.5-4.el7.aarch64
DEBUG util.py:393:  openssl-libs-1.0.1e-51.el7.4.aarch64
DEBUG util.py:393:  ca-certificates-2015.2.6-70.1.el7_2.noarch
DEBUG util.py:393:  cracklib-2.9.0-11.el7.aarch64
DEBUG util.py:393:  libblkid-2.23.2-26.el7_2.2.aarch64
DEBUG util.py:393:  libpwquality-1.2.3-4.el7.aarch64
DEBUG util.py:393:  systemd-libs-219-19.el7.4.aarch64
DEBUG util.py:393:  gdb-7.6.1-80.el7.aarch64
DEBUG util.py:393:  libutempter-1.1.6-4.el7.aarch64
DEBUG util.py:393:  nss-sysinit-3.21.0-9.el7.centos.aarch64
DEBUG util.py:393:  libssh2-1.4.3-10.el7_2.1.aarch64
DEBUG util.py:393:  curl-7.29.0-25.el7.aarch64
DEBUG util.py:393:  rpm-4.11.3-17.el7.aarch64
DEBUG util.py:393:  gnupg2-2.0.22-3.el7.aarch64
DEBUG util.py:393:  libuser-0.60-7.el7.aarch64
DEBUG util.py:393:  libcap-ng-0.7.5-4.el7.aarch64
DEBUG util.py:393:  rpm-build-4.11.3-17.el7.aarch64
DEBUG util.py:393:  which-2.20-7.el7.aarch64
DEBUG util.py:515:  Child return code was: 0
DEBUG util.py:535:  child environment: None
DEBUG util.py:468:  Executing command: ['/bin/rpm', '-Uvh', '--nodeps', '/builddir/build/originals/xfce4-battery-plugin-1.0.5-7.el7.src.rpm'] with env {'LANG': 'en_GB.UTF-8', 'TERM': 'vt100', 'SHELL': '/bin/bash', 'PROMPT_COMMAND': 'printf "\x1b]0;<mock-chroot>\x07<mock-chroot>"', 'PATH': '/usr/bin:/bin:/usr/sbin:/sbin', 'HOME': '/builddir', 'HOSTNAME': 'mock'} and shell False
DEBUG util.py:393:  warning: /builddir/build/originals/xfce4-battery-plugin-1.0.5-7.el7.src.rpm: Header V3 RSA/SHA256 Signature, key ID 352c64e5: NOKEY
DEBUG util.py:393:  Updating / installing...
DEBUG util.py:393:  xfce4-battery-plugin-1.0.5-7.el7      ########################################
DEBUG util.py:515:  Child return code was: 0
DEBUG util.py:535:  child environment: None
DEBUG util.py:468:  Executing command: ['/bin/rpm', '-qpl', '/builddir/build/originals/xfce4-battery-plugin-1.0.5-7.el7.src.rpm'] with env {'LANG': 'en_GB.UTF-8', 'TERM': 'vt100', 'SHELL': '/bin/bash', 'PROMPT_COMMAND': 'printf "\x1b]0;<mock-chroot>\x07<mock-chroot>"', 'PATH': '/usr/bin:/bin:/usr/sbin:/sbin', 'HOME': '/builddir', 'HOSTNAME': 'mock'} and shell False
DEBUG util.py:393:  warning: /builddir/build/originals/xfce4-battery-plugin-1.0.5-7.el7.src.rpm: Header V3 RSA/SHA256 Signature, key ID 352c64e5: NOKEY
DEBUG util.py:393:  xfce4-battery-plugin-1.0.5.tar.bz2
DEBUG util.py:393:  xfce4-battery-plugin.spec
DEBUG util.py:515:  Child return code was: 0
DEBUG util.py:535:  child environment: None
DEBUG package_manager.py:92:  ['/usr/bin/yum-builddep', '--installroot', '/srv/build/7/aarch64-C/mock-root/c7-epel.a64-aarch64/root/', '/srv/build/7/aarch64-C/mock-root/c7-epel.a64-aarch64/root//builddir/build/SRPMS/xfce4-battery-plugin-1.0.5-7.el7.src.rpm']
DEBUG util.py:535:  child environment: None
DEBUG util.py:468:  Executing command: ['/usr/bin/yum-builddep', '--installroot', '/srv/build/7/aarch64-C/mock-root/c7-epel.a64-aarch64/root/', '/srv/build/7/aarch64-C/mock-root/c7-epel.a64-aarch64/root//builddir/build/SRPMS/xfce4-battery-plugin-1.0.5-7.el7.src.rpm', '--setopt=tsflags=nocontexts'] with env {'LANG': 'en_GB.UTF-8', 'TERM': 'vt100', 'SHELL': '/bin/bash', 'LC_MESSAGES': 'C', 'PROMPT_COMMAND': 'printf "\x1b]0;<mock-chroot>\x07<mock-chroot>"', 'PATH': '/usr/bin:/bin:/usr/sbin:/sbin', 'HOME': '/builddir', 'HOSTNAME': 'mock'} and shell False
DEBUG util.py:393:  Getting requirements for xfce4-battery-plugin-1.0.5-7.el7.src
DEBUG util.py:393:   --> libxfce4ui-devel-4.10.0-12.el7.aarch64
DEBUG util.py:393:   --> xfce4-panel-devel-4.10.1-6.el7.aarch64
DEBUG util.py:393:   --> gettext-0.18.2.1-4.el7.aarch64
DEBUG util.py:393:   --> intltool-0.50.2-6.el7.noarch
DEBUG util.py:393:  ================================================================================
DEBUG util.py:393:   Package                 Arch    Version                   Repository      Size
DEBUG util.py:393:  ================================================================================
DEBUG util.py:393:  Installing:
DEBUG util.py:393:   gettext                 aarch64 0.18.2.1-4.el7            c7.1511.00.a64 950 k
DEBUG util.py:393:   intltool                noarch  0.50.2-6.el7              c7.1511.00.a64  59 k
DEBUG util.py:393:   libxfce4ui-devel        aarch64 4.10.0-12.el7             c7-epel.a64     40 k
DEBUG util.py:393:   xfce4-panel-devel       aarch64 4.10.1-6.el7              c7-epel.a64     61 k
DEBUG util.py:393:  Installing for dependencies:
DEBUG util.py:393:   acl                     aarch64 2.2.51-12.el7             c7.1511.00.a64  81 k
DEBUG util.py:393:   atk                     aarch64 2.14.0-1.el7              c7.1511.00.a64 248 k
DEBUG util.py:393:   atk-devel               aarch64 2.14.0-1.el7              c7.1511.00.a64 179 k
DEBUG util.py:393:   autoconf                noarch  2.69-11.el7               c7.1511.00.a64 701 k
DEBUG util.py:393:   automake                noarch  1.13.4-3.el7              c7.1511.00.a64 679 k
DEBUG util.py:393:   avahi-libs              aarch64 0.6.31-15.el7.1           c7.1511.00.a64  56 k
DEBUG util.py:393:   cairo                   aarch64 1.14.2-1.el7              c7.1511.00.a64 658 k
DEBUG util.py:393:   cairo-devel             aarch64 1.14.2-1.el7              c7.1511.00.a64 348 k
DEBUG util.py:393:   cryptsetup-libs         aarch64 1.6.7-1.el7               c7.1511.00.a64 177 k
DEBUG util.py:393:   cups-libs               aarch64 1:1.6.3-22.el7            c7.1511.00.a64 339 k
DEBUG util.py:393:   dbus                    aarch64 1:1.6.12-13.el7           c7.1511.00.a64 291 k
DEBUG util.py:393:   dbus-devel              aarch64 1:1.6.12-13.el7           c7.1511.00.a64  52 k
DEBUG util.py:393:   dbus-glib               aarch64 0.100-7.el7               c7.1511.00.a64  99 k
DEBUG util.py:393:   dbus-glib-devel         aarch64 0.100-7.el7               c7.1511.00.a64  53 k
DEBUG util.py:393:   dbus-libs               aarch64 1:1.6.12-13.el7           c7.1511.00.a64 141 k
DEBUG util.py:393:   dbus-x11                aarch64 1:1.6.12-13.el7           c7.1511.00.a64  45 k
DEBUG util.py:393:   device-mapper           aarch64 7:1.02.107-5.el7_2.2      c7.1511.u.a64  246 k
DEBUG util.py:393:   device-mapper-libs      aarch64 7:1.02.107-5.el7_2.2      c7.1511.u.a64  286 k
DEBUG util.py:393:   dracut                  aarch64 033-360.el7               c7.1511.00.a64 310 k
DEBUG util.py:393:   exo                     aarch64 0.10.2-8.el7              c7-epel.a64    514 k
DEBUG util.py:393:   expat-devel             aarch64 2.1.0-8.el7               c7.1511.00.a64  56 k
DEBUG util.py:393:   fipscheck               aarch64 1.4.1-5.el7               c7.1511.00.a64  21 k
DEBUG util.py:393:   fipscheck-lib           aarch64 1.4.1-5.el7               c7.1511.00.a64  10 k
DEBUG util.py:393:   fontconfig              aarch64 2.10.95-7.el7             c7.1511.00.a64 224 k
DEBUG util.py:393:   fontconfig-devel        aarch64 2.10.95-7.el7             c7.1511.00.a64 127 k
DEBUG util.py:393:   fontpackages-filesystem noarch  1.44-8.el7                c7.1511.00.a64 9.9 k
DEBUG util.py:393:   freetype                aarch64 2.4.11-11.el7             c7.1511.00.a64 363 k
DEBUG util.py:393:   freetype-devel          aarch64 2.4.11-11.el7             c7.1511.00.a64 355 k
DEBUG util.py:393:   garcon                  aarch64 0.2.1-5.el7               c7-epel.a64    144 k
DEBUG util.py:393:   gdk-pixbuf2             aarch64 2.31.6-3.el7              c7.1511.00.a64 550 k
DEBUG util.py:393:   gdk-pixbuf2-devel       aarch64 2.31.6-3.el7              c7.1511.00.a64 216 k
DEBUG util.py:393:   gettext-common-devel    noarch  0.18.2.1-4.el7            c7.1511.00.a64 368 k
DEBUG util.py:393:   gettext-devel           aarch64 0.18.2.1-4.el7            c7.1511.00.a64 313 k
DEBUG util.py:393:   gettext-libs            aarch64 0.18.2.1-4.el7            c7.1511.00.a64 391 k
DEBUG util.py:393:   git                     aarch64 1.8.3.1-6.el7_2.1         c7.1511.00.a64 4.4 M
DEBUG util.py:393:   gl-manpages             noarch  1.1-7.20130122.el7        c7.1511.00.a64 994 k
DEBUG util.py:393:   glib2-devel             aarch64 2.42.2-5.el7              c7.1511.00.a64 450 k
DEBUG util.py:393:   graphite2               aarch64 1.3.6-1.el7_2             c7.1511.u.a64  101 k
DEBUG util.py:393:   gtk2                    aarch64 2.24.28-8.el7             c7.1511.00.a64 3.2 M
DEBUG util.py:393:   gtk2-devel              aarch64 2.24.28-8.el7             c7.1511.00.a64 2.9 M
DEBUG util.py:393:   hardlink                aarch64 1:1.0-19.el7              c7.1511.00.a64  14 k
DEBUG util.py:393:   harfbuzz                aarch64 0.9.36-1.el7              c7.1511.00.a64 144 k
DEBUG util.py:393:   harfbuzz-devel          aarch64 0.9.36-1.el7              c7.1511.00.a64 106 k
DEBUG util.py:393:   harfbuzz-icu            aarch64 0.9.36-1.el7              c7.1511.00.a64  11 k
DEBUG util.py:393:   hicolor-icon-theme      noarch  0.12-7.el7                c7.1511.00.a64  42 k
DEBUG util.py:393:   jasper-libs             aarch64 1.900.1-29.el7            c7.1511.00.a64 136 k
DEBUG util.py:393:   jbigkit-libs            aarch64 2.0-11.el7                c7.1511.00.a64  45 k
DEBUG util.py:393:   kmod                    aarch64 20-5.el7                  c7.1511.00.a64 111 k
DEBUG util.py:393:   kmod-libs               aarch64 20-5.el7                  c7.1511.00.a64  43 k
DEBUG util.py:393:   kpartx                  aarch64 0.4.9-85.el7_2.4          c7.1511.u.a64   59 k
DEBUG util.py:393:   less                    aarch64 458-9.el7                 c7.1511.00.a64 115 k
DEBUG util.py:393:   libICE                  aarch64 1.0.9-2.el7               c7.1511.00.a64  62 k
DEBUG util.py:393:   libSM                   aarch64 1.2.2-2.el7               c7.1511.00.a64  38 k
DEBUG util.py:393:   libX11                  aarch64 1.6.3-2.el7               c7.1511.00.a64 579 k
DEBUG util.py:393:   libX11-common           noarch  1.6.3-2.el7               c7.1511.00.a64 162 k
DEBUG util.py:393:   libX11-devel            aarch64 1.6.3-2.el7               c7.1511.00.a64 980 k
DEBUG util.py:393:   libXau                  aarch64 1.0.8-2.1.el7             c7.1511.00.a64  29 k
DEBUG util.py:393:   libXau-devel            aarch64 1.0.8-2.1.el7             c7.1511.00.a64  14 k
DEBUG util.py:393:   libXcomposite           aarch64 0.4.4-4.1.el7             c7.1511.00.a64  22 k
DEBUG util.py:393:   libXcomposite-devel     aarch64 0.4.4-4.1.el7             c7.1511.00.a64  16 k
DEBUG util.py:393:   libXcursor              aarch64 1.1.14-2.1.el7            c7.1511.00.a64  28 k
DEBUG util.py:393:   libXcursor-devel        aarch64 1.1.14-2.1.el7            c7.1511.00.a64  22 k
DEBUG util.py:393:   libXdamage              aarch64 1.1.4-4.1.el7             c7.1511.00.a64  20 k
DEBUG util.py:393:   libXdamage-devel        aarch64 1.1.4-4.1.el7             c7.1511.00.a64 9.1 k
DEBUG util.py:393:   libXext                 aarch64 1.3.3-3.el7               c7.1511.00.a64  37 k
DEBUG util.py:393:   libXext-devel           aarch64 1.3.3-3.el7               c7.1511.00.a64  74 k
DEBUG util.py:393:   libXfixes               aarch64 5.0.1-2.1.el7             c7.1511.00.a64  18 k
DEBUG util.py:393:   libXfixes-devel         aarch64 5.0.1-2.1.el7             c7.1511.00.a64  12 k
DEBUG util.py:393:   libXft                  aarch64 2.3.2-2.el7               c7.1511.00.a64  56 k
DEBUG util.py:393:   libXft-devel            aarch64 2.3.2-2.el7               c7.1511.00.a64  19 k
DEBUG util.py:393:   libXi                   aarch64 1.7.4-2.el7               c7.1511.00.a64  38 k
DEBUG util.py:393:   libXi-devel             aarch64 1.7.4-2.el7               c7.1511.00.a64 104 k
DEBUG util.py:393:   libXinerama             aarch64 1.1.3-2.1.el7             c7.1511.00.a64  13 k
DEBUG util.py:393:   libXinerama-devel       aarch64 1.1.3-2.1.el7             c7.1511.00.a64  13 k
DEBUG util.py:393:   libXrandr               aarch64 1.4.2-2.el7               c7.1511.00.a64  25 k
DEBUG util.py:393:   libXrandr-devel         aarch64 1.4.2-2.el7               c7.1511.00.a64  20 k
DEBUG util.py:393:   libXrender              aarch64 0.9.8-2.1.el7             c7.1511.00.a64  24 k
DEBUG util.py:393:   libXrender-devel        aarch64 0.9.8-2.1.el7             c7.1511.00.a64  16 k
DEBUG util.py:393:   libXres                 aarch64 1.0.7-2.1.el7             c7.1511.00.a64  13 k
DEBUG util.py:393:   libXxf86vm              aarch64 1.1.3-2.1.el7             c7.1511.00.a64  17 k
DEBUG util.py:393:   libXxf86vm-devel        aarch64 1.1.3-2.1.el7             c7.1511.00.a64  18 k
DEBUG util.py:393:   libcroco                aarch64 0.6.8-5.el7               c7.1511.00.a64  96 k
DEBUG util.py:393:   libdrm                  aarch64 2.4.60-3.el7              c7.1511.00.a64  75 k
DEBUG util.py:393:   libdrm-devel            aarch64 2.4.60-3.el7              c7.1511.00.a64  90 k
DEBUG util.py:393:   libedit                 aarch64 3.0-12.20121213cvs.el7    c7.1511.00.a64  85 k
DEBUG util.py:393:   libgnome-keyring        aarch64 3.8.0-3.el7               c7.1511.00.a64 105 k
DEBUG util.py:393:   libicu                  aarch64 50.1.2-15.el7             c7.1511.00.a64 6.8 M
DEBUG util.py:393:   libicu-devel            aarch64 50.1.2-15.el7             c7.1511.00.a64 702 k
DEBUG util.py:393:   libjpeg-turbo           aarch64 1.2.90-5.el7              c7.1511.00.a64 117 k
DEBUG util.py:393:   libpng                  aarch64 2:1.5.13-7.el7            c7.1511.00.a64 206 k
DEBUG util.py:393:   libpng-devel            aarch64 2:1.5.13-7.el7            c7.1511.00.a64 121 k
DEBUG util.py:393:   libthai                 aarch64 0.1.14-9.el7              c7.1511.00.a64 185 k
DEBUG util.py:393:   libtiff                 aarch64 4.0.3-14.el7              c7.1511.00.a64 155 k
DEBUG util.py:393:   libunistring            aarch64 0.9.3-9.el7               c7.1511.00.a64 279 k
DEBUG util.py:393:   libwnck                 aarch64 2.31.0-1.el7              c7-epel.a64    350 k
DEBUG util.py:393:   libxcb                  aarch64 1.11-4.el7                c7.1511.00.a64 186 k
DEBUG util.py:393:   libxcb-devel            aarch64 1.11-4.el7                c7.1511.00.a64 1.1 M
DEBUG util.py:393:   libxfce4ui              aarch64 4.10.0-12.el7             c7-epel.a64    137 k
DEBUG util.py:393:   libxfce4util            aarch64 4.10.1-2.el7              c7-epel.a64    133 k
DEBUG util.py:393:   libxfce4util-devel      aarch64 4.10.1-2.el7              c7-epel.a64     42 k
DEBUG util.py:393:   libxshmfence            aarch64 1.2-1.el7                 c7.1511.00.a64 6.9 k
DEBUG util.py:393:   libxshmfence-devel      aarch64 1.2-1.el7                 c7.1511.00.a64 4.9 k
DEBUG util.py:393:   m4                      aarch64 1.4.16-10.el7             c7.1511.00.a64 251 k
DEBUG util.py:393:   mesa-libEGL             aarch64 10.6.5-3.20150824.el7     c7.1511.00.a64  69 k
DEBUG util.py:393:   mesa-libEGL-devel       aarch64 10.6.5-3.20150824.el7     c7.1511.00.a64  27 k
DEBUG util.py:393:   mesa-libGL              aarch64 10.6.5-3.20150824.el7     c7.1511.00.a64 180 k
DEBUG util.py:393:   mesa-libGL-devel        aarch64 10.6.5-3.20150824.el7     c7.1511.00.a64 147 k
DEBUG util.py:393:   mesa-libgbm             aarch64 10.6.5-3.20150824.el7     c7.1511.00.a64  39 k
DEBUG util.py:393:   mesa-libglapi           aarch64 10.6.5-3.20150824.el7     c7.1511.00.a64  47 k
DEBUG util.py:393:   openssh                 aarch64 6.6.1p1-25.el7            c7.1511.00.a64 402 k
DEBUG util.py:393:   openssh-clients         aarch64 6.6.1p1-25.el7            c7.1511.00.a64 622 k
DEBUG util.py:393:   pango                   aarch64 1.36.8-2.el7              c7.1511.00.a64 277 k
DEBUG util.py:393:   pango-devel             aarch64 1.36.8-2.el7              c7.1511.00.a64 321 k
DEBUG util.py:393:   perl-Data-Dumper        aarch64 2.145-3.el7               c7.1511.00.a64  46 k
DEBUG util.py:393:   perl-Error              noarch  1:0.17020-2.el7           c7.1511.00.a64  32 k
DEBUG util.py:393:   perl-Git                noarch  1.8.3.1-6.el7_2.1         c7.1511.00.a64  53 k
DEBUG util.py:393:   perl-TermReadKey        aarch64 2.30-20.el7               c7.1511.00.a64  30 k
DEBUG util.py:393:   perl-Test-Harness       noarch  3.28-3.el7                c7.1511.00.a64 302 k
DEBUG util.py:393:   perl-XML-Parser         aarch64 2.41-10.el7               c7.1511.00.a64 221 k
DEBUG util.py:393:   pixman                  aarch64 0.32.6-3.el7              c7.1511.00.a64 144 k
DEBUG util.py:393:   pixman-devel            aarch64 0.32.6-3.el7              c7.1511.00.a64  19 k
DEBUG util.py:393:   procps-ng               aarch64 3.3.10-5.el7              c7.1511.00.a64 286 k
DEBUG util.py:393:   python                  aarch64 2.7.5-34.el7              c7.1511.00.a64  88 k
DEBUG util.py:393:   qrencode-libs           aarch64 3.4.1-3.el7               c7.1511.00.a64  48 k
DEBUG util.py:393:   rsync                   aarch64 3.0.9-17.el7              c7.1511.00.a64 350 k
DEBUG util.py:393:   startup-notification    aarch64 0.12-8.el7                c7.1511.00.a64  38 k
DEBUG util.py:393:   systemd                 aarch64 219-19.el7.4              c7.1511.00.a64 4.7 M
DEBUG util.py:393:   xcb-util                aarch64 0.4.0-2.el7               c7.1511.00.a64  15 k
DEBUG util.py:393:   xfce4-panel             aarch64 4.10.1-6.el7              c7-epel.a64    717 k
DEBUG util.py:393:   xfconf                  aarch64 4.10.0-7.el7              c7-epel.a64    180 k
DEBUG util.py:393:   xfconf-devel            aarch64 4.10.0-7.el7              c7-epel.a64     31 k
DEBUG util.py:393:   xorg-x11-proto-devel    noarch  7.7-12.el7                c7.1511.00.a64 281 k
DEBUG util.py:393:   zlib-devel              aarch64 1.2.7-15.el7              c7.1511.00.a64  49 k
DEBUG util.py:393:  Transaction Summary
DEBUG util.py:393:  ================================================================================
DEBUG util.py:393:  Install  4 Packages (+133 Dependent packages)
DEBUG util.py:393:  Total download size: 45 M
DEBUG util.py:393:  Installed size: 197 M
DEBUG util.py:393:  Installed:
DEBUG util.py:393:    gettext.aarch64 0:0.18.2.1-4.el7                                              
DEBUG util.py:393:    intltool.noarch 0:0.50.2-6.el7                                                
DEBUG util.py:393:    libxfce4ui-devel.aarch64 0:4.10.0-12.el7                                      
DEBUG util.py:393:    xfce4-panel-devel.aarch64 0:4.10.1-6.el7                                      
DEBUG util.py:393:  Dependency Installed:
DEBUG util.py:393:    acl.aarch64 0:2.2.51-12.el7                                                   
DEBUG util.py:393:    atk.aarch64 0:2.14.0-1.el7                                                    
DEBUG util.py:393:    atk-devel.aarch64 0:2.14.0-1.el7                                              
DEBUG util.py:393:    autoconf.noarch 0:2.69-11.el7                                                 
DEBUG util.py:393:    automake.noarch 0:1.13.4-3.el7                                                
DEBUG util.py:393:    avahi-libs.aarch64 0:0.6.31-15.el7.1                                          
DEBUG util.py:393:    cairo.aarch64 0:1.14.2-1.el7                                                  
DEBUG util.py:393:    cairo-devel.aarch64 0:1.14.2-1.el7                                            
DEBUG util.py:393:    cryptsetup-libs.aarch64 0:1.6.7-1.el7                                         
DEBUG util.py:393:    cups-libs.aarch64 1:1.6.3-22.el7                                              
DEBUG util.py:393:    dbus.aarch64 1:1.6.12-13.el7                                                  
DEBUG util.py:393:    dbus-devel.aarch64 1:1.6.12-13.el7                                            
DEBUG util.py:393:    dbus-glib.aarch64 0:0.100-7.el7                                               
DEBUG util.py:393:    dbus-glib-devel.aarch64 0:0.100-7.el7                                         
DEBUG util.py:393:    dbus-libs.aarch64 1:1.6.12-13.el7                                             
DEBUG util.py:393:    dbus-x11.aarch64 1:1.6.12-13.el7                                              
DEBUG util.py:393:    device-mapper.aarch64 7:1.02.107-5.el7_2.2                                    
DEBUG util.py:393:    device-mapper-libs.aarch64 7:1.02.107-5.el7_2.2                               
DEBUG util.py:393:    dracut.aarch64 0:033-360.el7                                                  
DEBUG util.py:393:    exo.aarch64 0:0.10.2-8.el7                                                    
DEBUG util.py:393:    expat-devel.aarch64 0:2.1.0-8.el7                                             
DEBUG util.py:393:    fipscheck.aarch64 0:1.4.1-5.el7                                               
DEBUG util.py:393:    fipscheck-lib.aarch64 0:1.4.1-5.el7                                           
DEBUG util.py:393:    fontconfig.aarch64 0:2.10.95-7.el7                                            
DEBUG util.py:393:    fontconfig-devel.aarch64 0:2.10.95-7.el7                                      
DEBUG util.py:393:    fontpackages-filesystem.noarch 0:1.44-8.el7                                   
DEBUG util.py:393:    freetype.aarch64 0:2.4.11-11.el7                                              
DEBUG util.py:393:    freetype-devel.aarch64 0:2.4.11-11.el7                                        
DEBUG util.py:393:    garcon.aarch64 0:0.2.1-5.el7                                                  
DEBUG util.py:393:    gdk-pixbuf2.aarch64 0:2.31.6-3.el7                                            
DEBUG util.py:393:    gdk-pixbuf2-devel.aarch64 0:2.31.6-3.el7                                      
DEBUG util.py:393:    gettext-common-devel.noarch 0:0.18.2.1-4.el7                                  
DEBUG util.py:393:    gettext-devel.aarch64 0:0.18.2.1-4.el7                                        
DEBUG util.py:393:    gettext-libs.aarch64 0:0.18.2.1-4.el7                                         
DEBUG util.py:393:    git.aarch64 0:1.8.3.1-6.el7_2.1                                               
DEBUG util.py:393:    gl-manpages.noarch 0:1.1-7.20130122.el7                                       
DEBUG util.py:393:    glib2-devel.aarch64 0:2.42.2-5.el7                                            
DEBUG util.py:393:    graphite2.aarch64 0:1.3.6-1.el7_2                                             
DEBUG util.py:393:    gtk2.aarch64 0:2.24.28-8.el7                                                  
DEBUG util.py:393:    gtk2-devel.aarch64 0:2.24.28-8.el7                                            
DEBUG util.py:393:    hardlink.aarch64 1:1.0-19.el7                                                 
DEBUG util.py:393:    harfbuzz.aarch64 0:0.9.36-1.el7                                               
DEBUG util.py:393:    harfbuzz-devel.aarch64 0:0.9.36-1.el7                                         
DEBUG util.py:393:    harfbuzz-icu.aarch64 0:0.9.36-1.el7                                           
DEBUG util.py:393:    hicolor-icon-theme.noarch 0:0.12-7.el7                                        
DEBUG util.py:393:    jasper-libs.aarch64 0:1.900.1-29.el7                                          
DEBUG util.py:393:    jbigkit-libs.aarch64 0:2.0-11.el7                                             
DEBUG util.py:393:    kmod.aarch64 0:20-5.el7                                                       
DEBUG util.py:393:    kmod-libs.aarch64 0:20-5.el7                                                  
DEBUG util.py:393:    kpartx.aarch64 0:0.4.9-85.el7_2.4                                             
DEBUG util.py:393:    less.aarch64 0:458-9.el7                                                      
DEBUG util.py:393:    libICE.aarch64 0:1.0.9-2.el7                                                  
DEBUG util.py:393:    libSM.aarch64 0:1.2.2-2.el7                                                   
DEBUG util.py:393:    libX11.aarch64 0:1.6.3-2.el7                                                  
DEBUG util.py:393:    libX11-common.noarch 0:1.6.3-2.el7                                            
DEBUG util.py:393:    libX11-devel.aarch64 0:1.6.3-2.el7                                            
DEBUG util.py:393:    libXau.aarch64 0:1.0.8-2.1.el7                                                
DEBUG util.py:393:    libXau-devel.aarch64 0:1.0.8-2.1.el7                                          
DEBUG util.py:393:    libXcomposite.aarch64 0:0.4.4-4.1.el7                                         
DEBUG util.py:393:    libXcomposite-devel.aarch64 0:0.4.4-4.1.el7                                   
DEBUG util.py:393:    libXcursor.aarch64 0:1.1.14-2.1.el7                                           
DEBUG util.py:393:    libXcursor-devel.aarch64 0:1.1.14-2.1.el7                                     
DEBUG util.py:393:    libXdamage.aarch64 0:1.1.4-4.1.el7                                            
DEBUG util.py:393:    libXdamage-devel.aarch64 0:1.1.4-4.1.el7                                      
DEBUG util.py:393:    libXext.aarch64 0:1.3.3-3.el7                                                 
DEBUG util.py:393:    libXext-devel.aarch64 0:1.3.3-3.el7                                           
DEBUG util.py:393:    libXfixes.aarch64 0:5.0.1-2.1.el7                                             
DEBUG util.py:393:    libXfixes-devel.aarch64 0:5.0.1-2.1.el7                                       
DEBUG util.py:393:    libXft.aarch64 0:2.3.2-2.el7                                                  
DEBUG util.py:393:    libXft-devel.aarch64 0:2.3.2-2.el7                                            
DEBUG util.py:393:    libXi.aarch64 0:1.7.4-2.el7                                                   
DEBUG util.py:393:    libXi-devel.aarch64 0:1.7.4-2.el7                                             
DEBUG util.py:393:    libXinerama.aarch64 0:1.1.3-2.1.el7                                           
DEBUG util.py:393:    libXinerama-devel.aarch64 0:1.1.3-2.1.el7                                     
DEBUG util.py:393:    libXrandr.aarch64 0:1.4.2-2.el7                                               
DEBUG util.py:393:    libXrandr-devel.aarch64 0:1.4.2-2.el7                                         
DEBUG util.py:393:    libXrender.aarch64 0:0.9.8-2.1.el7                                            
DEBUG util.py:393:    libXrender-devel.aarch64 0:0.9.8-2.1.el7                                      
DEBUG util.py:393:    libXres.aarch64 0:1.0.7-2.1.el7                                               
DEBUG util.py:393:    libXxf86vm.aarch64 0:1.1.3-2.1.el7                                            
DEBUG util.py:393:    libXxf86vm-devel.aarch64 0:1.1.3-2.1.el7                                      
DEBUG util.py:393:    libcroco.aarch64 0:0.6.8-5.el7                                                
DEBUG util.py:393:    libdrm.aarch64 0:2.4.60-3.el7                                                 
DEBUG util.py:393:    libdrm-devel.aarch64 0:2.4.60-3.el7                                           
DEBUG util.py:393:    libedit.aarch64 0:3.0-12.20121213cvs.el7                                      
DEBUG util.py:393:    libgnome-keyring.aarch64 0:3.8.0-3.el7                                        
DEBUG util.py:393:    libicu.aarch64 0:50.1.2-15.el7                                                
DEBUG util.py:393:    libicu-devel.aarch64 0:50.1.2-15.el7                                          
DEBUG util.py:393:    libjpeg-turbo.aarch64 0:1.2.90-5.el7                                          
DEBUG util.py:393:    libpng.aarch64 2:1.5.13-7.el7                                                 
DEBUG util.py:393:    libpng-devel.aarch64 2:1.5.13-7.el7                                           
DEBUG util.py:393:    libthai.aarch64 0:0.1.14-9.el7                                                
DEBUG util.py:393:    libtiff.aarch64 0:4.0.3-14.el7                                                
DEBUG util.py:393:    libunistring.aarch64 0:0.9.3-9.el7                                            
DEBUG util.py:393:    libwnck.aarch64 0:2.31.0-1.el7                                                
DEBUG util.py:393:    libxcb.aarch64 0:1.11-4.el7                                                   
DEBUG util.py:393:    libxcb-devel.aarch64 0:1.11-4.el7                                             
DEBUG util.py:393:    libxfce4ui.aarch64 0:4.10.0-12.el7                                            
DEBUG util.py:393:    libxfce4util.aarch64 0:4.10.1-2.el7                                           
DEBUG util.py:393:    libxfce4util-devel.aarch64 0:4.10.1-2.el7                                     
DEBUG util.py:393:    libxshmfence.aarch64 0:1.2-1.el7                                              
DEBUG util.py:393:    libxshmfence-devel.aarch64 0:1.2-1.el7                                        
DEBUG util.py:393:    m4.aarch64 0:1.4.16-10.el7                                                    
DEBUG util.py:393:    mesa-libEGL.aarch64 0:10.6.5-3.20150824.el7                                   
DEBUG util.py:393:    mesa-libEGL-devel.aarch64 0:10.6.5-3.20150824.el7                             
DEBUG util.py:393:    mesa-libGL.aarch64 0:10.6.5-3.20150824.el7                                    
DEBUG util.py:393:    mesa-libGL-devel.aarch64 0:10.6.5-3.20150824.el7                              
DEBUG util.py:393:    mesa-libgbm.aarch64 0:10.6.5-3.20150824.el7                                   
DEBUG util.py:393:    mesa-libglapi.aarch64 0:10.6.5-3.20150824.el7                                 
DEBUG util.py:393:    openssh.aarch64 0:6.6.1p1-25.el7                                              
DEBUG util.py:393:    openssh-clients.aarch64 0:6.6.1p1-25.el7                                      
DEBUG util.py:393:    pango.aarch64 0:1.36.8-2.el7                                                  
DEBUG util.py:393:    pango-devel.aarch64 0:1.36.8-2.el7                                            
DEBUG util.py:393:    perl-Data-Dumper.aarch64 0:2.145-3.el7                                        
DEBUG util.py:393:    perl-Error.noarch 1:0.17020-2.el7                                             
DEBUG util.py:393:    perl-Git.noarch 0:1.8.3.1-6.el7_2.1                                           
DEBUG util.py:393:    perl-TermReadKey.aarch64 0:2.30-20.el7                                        
DEBUG util.py:393:    perl-Test-Harness.noarch 0:3.28-3.el7                                         
DEBUG util.py:393:    perl-XML-Parser.aarch64 0:2.41-10.el7                                         
DEBUG util.py:393:    pixman.aarch64 0:0.32.6-3.el7                                                 
DEBUG util.py:393:    pixman-devel.aarch64 0:0.32.6-3.el7                                           
DEBUG util.py:393:    procps-ng.aarch64 0:3.3.10-5.el7                                              
DEBUG util.py:393:    python.aarch64 0:2.7.5-34.el7                                                 
DEBUG util.py:393:    qrencode-libs.aarch64 0:3.4.1-3.el7                                           
DEBUG util.py:393:    rsync.aarch64 0:3.0.9-17.el7                                                  
DEBUG util.py:393:    startup-notification.aarch64 0:0.12-8.el7                                     
DEBUG util.py:393:    systemd.aarch64 0:219-19.el7.4                                                
DEBUG util.py:393:    xcb-util.aarch64 0:0.4.0-2.el7                                                
DEBUG util.py:393:    xfce4-panel.aarch64 0:4.10.1-6.el7                                            
DEBUG util.py:393:    xfconf.aarch64 0:4.10.0-7.el7                                                 
DEBUG util.py:393:    xfconf-devel.aarch64 0:4.10.0-7.el7                                           
DEBUG util.py:393:    xorg-x11-proto-devel.noarch 0:7.7-12.el7                                      
DEBUG util.py:393:    zlib-devel.aarch64 0:1.2.7-15.el7                                             
DEBUG util.py:515:  Child return code was: 0
DEBUG util.py:535:  child environment: None
DEBUG util.py:172:  kill orphans
DEBUG util.py:535:  child environment: None
DEBUG util.py:468:  Executing command: ['/bin/umount', '-n', '/srv/build/7/aarch64-C/mock-root/c7-epel.a64-aarch64/root/proc/filesystems'] with env {'LANG': 'en_GB.UTF-8', 'TERM': 'vt100', 'SHELL': '/bin/sh', 'HOSTNAME': 'mock', 'HOME': '/builddir', 'PATH': '/usr/bin:/bin:/usr/sbin:/sbin'} and shell False
DEBUG util.py:515:  Child return code was: 0
DEBUG util.py:535:  child environment: None
DEBUG util.py:468:  Executing command: ['/bin/umount', '-n', '-l', '/srv/build/7/aarch64-C/mock-root/c7-epel.a64-aarch64/root/dev/pts'] with env {'LANG': 'en_GB.UTF-8', 'TERM': 'vt100', 'SHELL': '/bin/sh', 'HOSTNAME': 'mock', 'HOME': '/builddir', 'PATH': '/usr/bin:/bin:/usr/sbin:/sbin'} and shell False
DEBUG util.py:515:  Child return code was: 0
DEBUG util.py:535:  child environment: None
DEBUG util.py:468:  Executing command: ['/bin/umount', '-n', '-l', '/srv/build/7/aarch64-C/mock-root/c7-epel.a64-aarch64/root/dev/shm'] with env {'LANG': 'en_GB.UTF-8', 'TERM': 'vt100', 'SHELL': '/bin/sh', 'HOSTNAME': 'mock', 'HOME': '/builddir', 'PATH': '/usr/bin:/bin:/usr/sbin:/sbin'} and shell False
DEBUG util.py:515:  Child return code was: 0
DEBUG util.py:535:  child environment: None
DEBUG util.py:468:  Executing command: ['/bin/umount', '-n', '-l', '/srv/build/7/aarch64-C/mock-root/c7-epel.a64-aarch64/root/sys'] with env {'LANG': 'en_GB.UTF-8', 'TERM': 'vt100', 'SHELL': '/bin/sh', 'HOSTNAME': 'mock', 'HOME': '/builddir', 'PATH': '/usr/bin:/bin:/usr/sbin:/sbin'} and shell False
DEBUG util.py:515:  Child return code was: 0
DEBUG util.py:535:  child environment: None
DEBUG util.py:468:  Executing command: ['/bin/umount', '-n', '-l', '/srv/build/7/aarch64-C/mock-root/c7-epel.a64-aarch64/root/proc'] with env {'LANG': 'en_GB.UTF-8', 'TERM': 'vt100', 'SHELL': '/bin/sh', 'HOSTNAME': 'mock', 'HOME': '/builddir', 'PATH': '/usr/bin:/bin:/usr/sbin:/sbin'} and shell False
DEBUG util.py:515:  Child return code was: 0
DEBUG util.py:535:  child environment: None
DEBUG util.py:468:  Executing command: ['btrfs', 'subv', 'list', '/srv/build/7/aarch64-C/mock-root'] with env {'LANG': 'en_GB.UTF-8', 'TERM': 'vt100', 'SHELL': '/bin/sh', 'HOSTNAME': 'mock', 'HOME': '/builddir', 'PATH': '/usr/bin:/bin:/usr/sbin:/sbin'} and shell False
DEBUG util.py:393:  ERROR: can't perform the search - Inappropriate ioctl for device
DEBUG util.py:393:  ERROR: can't get rootid for '/srv/build/7/aarch64-C/mock-root'
DEBUG util.py:515:  Child return code was: 1
---------------------------------------------
BUILD log: ----------------( last 500 lines )-----\n\n
Mock Version: 1.2.13
ENTER do(['bash', '--login', '-c', '/usr/bin/rpmbuild -bs --target aarch64 --nodeps /builddir/build/SPECS/xfce4-battery-plugin.spec'], chrootPath='/srv/build/7/aarch64-C/mock-root/c7-epel.a64-aarch64/root'shell=FalseprintOutput=Falseenv={'LANG': 'en_GB.UTF-8', 'TERM': 'vt100', 'SHELL': '/bin/bash', 'PROMPT_COMMAND': 'printf "\x1b]0;<mock-chroot>\x07<mock-chroot>"', 'PATH': '/usr/bin:/bin:/usr/sbin:/sbin', 'HOME': '/builddir', 'HOSTNAME': 'mock'}gid=135user='mockbuild'timeout=21600logger=<mockbuild.trace_decorator.getLog object at 0x169c06d0>uid=1006)
Executing command: ['bash', '--login', '-c', '/usr/bin/rpmbuild -bs --target aarch64 --nodeps /builddir/build/SPECS/xfce4-battery-plugin.spec'] with env {'LANG': 'en_GB.UTF-8', 'TERM': 'vt100', 'SHELL': '/bin/bash', 'PROMPT_COMMAND': 'printf "\x1b]0;<mock-chroot>\x07<mock-chroot>"', 'PATH': '/usr/bin:/bin:/usr/sbin:/sbin', 'HOME': '/builddir', 'HOSTNAME': 'mock'} and shell False
warning: Could not canonicalize hostname: n16.lon1.centos.org
Building target platforms: aarch64
Building for target aarch64
Wrote: /builddir/build/SRPMS/xfce4-battery-plugin-1.0.5-7.el7.src.rpm
Child return code was: 0
LEAVE do --> 

ENTER do(['bash', '--login', '-c', '/usr/bin/rpmbuild -bb --target aarch64 --nodeps  /builddir/build/SPECS/xfce4-battery-plugin.spec '], chrootPath='/srv/build/7/aarch64-C/mock-root/c7-epel.a64-aarch64/root'shell=Falseuid=1006env={'LANG': 'en_GB.UTF-8', 'TERM': 'vt100', 'SHELL': '/bin/bash', 'PROMPT_COMMAND': 'printf "\x1b]0;<mock-chroot>\x07<mock-chroot>"', 'PATH': '/usr/bin:/bin:/usr/sbin:/sbin', 'HOME': '/builddir', 'HOSTNAME': 'mock'}gid=135user='mockbuild'timeout=21600private_network=Truelogger=<mockbuild.trace_decorator.getLog object at 0x169c06d0>printOutput=False)
Executing command: ['bash', '--login', '-c', '/usr/bin/rpmbuild -bb --target aarch64 --nodeps  /builddir/build/SPECS/xfce4-battery-plugin.spec '] with env {'LANG': 'en_GB.UTF-8', 'TERM': 'vt100', 'SHELL': '/bin/bash', 'PROMPT_COMMAND': 'printf "\x1b]0;<mock-chroot>\x07<mock-chroot>"', 'PATH': '/usr/bin:/bin:/usr/sbin:/sbin', 'HOME': '/builddir', 'HOSTNAME': 'mock'} and shell False
Building target platforms: aarch64
Building for target aarch64
Executing(%prep): /bin/sh -e /var/tmp/rpm-tmp.sNXq6J
+ umask 022
+ cd /builddir/build/BUILD
+ cd /builddir/build/BUILD
+ rm -rf xfce4-battery-plugin-1.0.5
+ /usr/bin/bzip2 -dc /builddir/build/SOURCES/xfce4-battery-plugin-1.0.5.tar.bz2
+ /usr/bin/tar -xf -
+ STATUS=0
+ '[' 0 -ne 0 ']'
+ cd xfce4-battery-plugin-1.0.5
+ /usr/bin/chmod -Rf a+rX,u+w,g-w,o-w .
+ exit 0
Executing(%build): /bin/sh -e /var/tmp/rpm-tmp.a0e7Wy
+ umask 022
+ cd /builddir/build/BUILD
+ cd xfce4-battery-plugin-1.0.5
+ CFLAGS='-O2 -g -pipe -Wall -Wp,-D_FORTIFY_SOURCE=2 -fexceptions -fstack-protector-strong --param=ssp-buffer-size=4 -grecord-gcc-switches  '
+ export CFLAGS
+ CXXFLAGS='-O2 -g -pipe -Wall -Wp,-D_FORTIFY_SOURCE=2 -fexceptions -fstack-protector-strong --param=ssp-buffer-size=4 -grecord-gcc-switches  '
+ export CXXFLAGS
+ FFLAGS='-O2 -g -pipe -Wall -Wp,-D_FORTIFY_SOURCE=2 -fexceptions -fstack-protector-strong --param=ssp-buffer-size=4 -grecord-gcc-switches   -I/usr/lib64/gfortran/modules'
+ export FFLAGS
+ FCFLAGS='-O2 -g -pipe -Wall -Wp,-D_FORTIFY_SOURCE=2 -fexceptions -fstack-protector-strong --param=ssp-buffer-size=4 -grecord-gcc-switches   -I/usr/lib64/gfortran/modules'
+ export FCFLAGS
+ LDFLAGS='-Wl,-z,relro '
+ export LDFLAGS
+ '[' 1 == 1 ']'
+ '[' aarch64 == ppc64le ']'
++ find . -name config.guess -o -name config.sub
+ for i in '$(find . -name config.guess -o -name config.sub)'
++ basename ./config.guess
+ '[' -f /usr/lib/rpm/redhat/config.guess ']'
+ /usr/bin/rm -f ./config.guess
++ basename ./config.guess
+ /usr/bin/cp -fv /usr/lib/rpm/redhat/config.guess ./config.guess
'/usr/lib/rpm/redhat/config.guess' -> './config.guess'
+ for i in '$(find . -name config.guess -o -name config.sub)'
++ basename ./config.sub
+ '[' -f /usr/lib/rpm/redhat/config.sub ']'
+ /usr/bin/rm -f ./config.sub
++ basename ./config.sub
+ /usr/bin/cp -fv /usr/lib/rpm/redhat/config.sub ./config.sub
'/usr/lib/rpm/redhat/config.sub' -> './config.sub'
+ ./configure --build=aarch64-redhat-linux-gnu --host=aarch64-redhat-linux-gnu --program-prefix= --disable-dependency-tracking --prefix=/usr --exec-prefix=/usr --bindir=/usr/bin --sbindir=/usr/sbin --sysconfdir=/etc --datadir=/usr/share --includedir=/usr/include --libdir=/usr/lib64 --libexecdir=/usr/libexec --localstatedir=/var --sharedstatedir=/var/lib --mandir=/usr/share/man --infodir=/usr/share/info
checking build system type... aarch64-redhat-linux-gnu
checking host system type... aarch64-redhat-linux-gnu
checking target system type... aarch64-redhat-linux-gnu
checking for a BSD-compatible install... /usr/bin/install -c
checking for gawk... gawk
checking whether make sets $(MAKE)... yes
checking how to create a ustar tar archive... gnutar
checking whether to enable maintainer-specific portions of Makefiles... no
checking for aarch64-redhat-linux-gnu-gcc... no
checking for gcc... gcc
checking for C compiler default output file name... a.out
checking whether the C compiler works... yes
checking whether we are cross compiling... no
checking for suffix of executables... 
checking for suffix of object files... o
checking whether we are using the GNU C compiler... yes
checking whether gcc accepts -g... yes
checking for gcc option to accept ISO C89... none needed
checking for style of include used by make... GNU
checking dependency style of gcc... none
checking for a sed that does not truncate output... /usr/bin/sed
checking for grep that handles long lines and -e... /usr/bin/grep
checking for egrep... /usr/bin/grep -E
checking for fgrep... /usr/bin/grep -F
checking how to print strings... printf
checking for ld used by gcc... /usr/bin/ld
checking if the linker (/usr/bin/ld) is GNU ld... yes
checking for a BSD-compatible install... /usr/bin/install -c
checking whether NLS is requested... yes
checking for intltool-update... /usr/bin/intltool-update
checking for intltool-merge... /usr/bin/intltool-merge
checking for intltool-extract... /usr/bin/intltool-extract
checking for xgettext... /usr/bin/xgettext
checking for msgmerge... /usr/bin/msgmerge
checking for msgfmt... /usr/bin/msgfmt
checking for gmsgfmt... /usr/bin/msgfmt
checking for perl... /usr/bin/perl
checking for perl >= 5.8.1... 5.16.3
checking for XML::Parser... ok
checking for BSD- or MS-compatible name lister (nm)... /usr/bin/nm -B
checking the name lister (/usr/bin/nm -B) interface... BSD nm
checking whether ln -s works... yes
checking the maximum length of command line arguments... 1572864
checking whether the shell understands some XSI constructs... yes
checking whether the shell understands "+="... yes
checking how to convert aarch64-redhat-linux-gnu file names to aarch64-redhat-linux-gnu format... func_convert_file_noop
checking how to convert aarch64-redhat-linux-gnu file names to toolchain format... func_convert_file_noop
checking for /usr/bin/ld option to reload object files... -r
checking for aarch64-redhat-linux-gnu-objdump... no
checking for objdump... objdump
checking how to recognize dependent libraries... pass_all
checking for aarch64-redhat-linux-gnu-dlltool... no
checking for dlltool... no
checking how to associate runtime and link libraries... printf %s\n
checking for aarch64-redhat-linux-gnu-ar... no
checking for ar... ar
checking for archiver @FILE support... @
checking for aarch64-redhat-linux-gnu-strip... no
checking for strip... strip
checking for aarch64-redhat-linux-gnu-ranlib... no
checking for ranlib... ranlib
checking command to parse /usr/bin/nm -B output from gcc object... ok
checking for sysroot... no
checking for aarch64-redhat-linux-gnu-mt... no
checking for mt... no
checking if : is a manifest tool... no
checking how to run the C preprocessor... gcc -E
checking for ANSI C header files... yes
checking for sys/types.h... yes
checking for sys/stat.h... yes
checking for stdlib.h... yes
checking for string.h... yes
checking for memory.h... yes
checking for strings.h... yes
checking for inttypes.h... yes
checking for stdint.h... yes
checking for unistd.h... yes
checking for dlfcn.h... yes
checking for objdir... .libs
checking if gcc supports -fno-rtti -fno-exceptions... no
checking for gcc option to produce PIC... -fPIC -DPIC
checking if gcc PIC flag -fPIC -DPIC works... yes
checking if gcc static flag -static works... no
checking if gcc supports -c -o file.o... yes
checking if gcc supports -c -o file.o... (cached) yes
checking whether the gcc linker (/usr/bin/ld) supports shared libraries... yes
checking whether -lc should be explicitly linked in... no
checking dynamic linker characteristics... GNU/Linux ld.so
checking how to hardcode library paths into programs... immediate
checking whether stripping libraries is possible... yes
checking if libtool supports shared libraries... yes
checking whether to build shared libraries... yes
checking whether to build static libraries... no
checking dirent.h usability... yes
checking dirent.h presence... yes
checking for dirent.h... yes
checking stdio.h usability... yes
checking stdio.h presence... yes
checking for stdio.h... yes
checking for stdlib.h... (cached) yes
checking for unistd.h... (cached) yes
checking for string.h... (cached) yes
checking fcntl.h usability... yes
checking fcntl.h presence... yes
checking for fcntl.h... yes
checking ctype.h usability... yes
checking ctype.h presence... yes
checking for ctype.h... yes
checking for sys/stat.h... (cached) yes
checking sys/time.h usability... yes
checking sys/time.h presence... yes
checking for sys/time.h... yes
checking sys/ioctl.h usability... yes
checking sys/ioctl.h presence... yes
checking for sys/ioctl.h... yes
checking for sys/types.h... (cached) yes
checking for sysctl... no
checking locale.h usability... yes
checking locale.h presence... yes
checking for locale.h... yes
checking for LC_MESSAGES... yes
checking libintl.h usability... yes
checking libintl.h presence... yes
checking for libintl.h... yes
checking for ngettext in libc... yes
checking for dgettext in libc... yes
checking for bind_textdomain_codeset... yes
checking for msgfmt... (cached) /usr/bin/msgfmt
checking for dcgettext... yes
checking if msgfmt accepts -c... yes
checking for gmsgfmt... (cached) /usr/bin/msgfmt
checking for xgettext... (cached) /usr/bin/xgettext
checking for catalogs to be installed...  ar ast bg ca cs da de el en_GB es eu fi fr gl hr hu id is it ja kk ko lt lv nb nl nn pa pl pt pt_BR ru sk sq sv tr ug uk ur ur_PK vi zh_CN zh_TW
checking for bind_textdomain_codeset... (cached) yes
checking for locales directory... /usr/share/locale
checking for additional xgettext flags... --keyword=Q_ --from-code=UTF-8
checking for aarch64-redhat-linux-gnu-pkg-config... no
checking for pkg-config... /usr/bin/pkg-config
checking pkg-config is at least version 0.9.0... yes
checking for gtk+-2.0 >= 2.20.0... 2.24.28
checking GTK_CFLAGS... -pthread -I/usr/include/gtk-2.0 -I/usr/lib64/gtk-2.0/include -I/usr/include/atk-1.0 -I/usr/include/cairo -I/usr/include/gdk-pixbuf-2.0 -I/usr/include/pango-1.0 -I/usr/include/glib-2.0 -I/usr/lib64/glib-2.0/include -I/usr/include/pixman-1 -I/usr/include/freetype2 -I/usr/include/libpng15 -I/usr/include/libdrm -I/usr/include/harfbuzz  
checking GTK_LIBS... -lgtk-x11-2.0 -lgdk-x11-2.0 -latk-1.0 -lgio-2.0 -lpangoft2-1.0 -lpangocairo-1.0 -lgdk_pixbuf-2.0 -lcairo -lpango-1.0 -lfontconfig -lgobject-2.0 -lglib-2.0 -lfreetype  
checking for aarch64-redhat-linux-gnu-pkg-config... /usr/bin/pkg-config
checking pkg-config is at least version 0.9.0... yes
checking for gthread-2.0 >= 2.24.0... 2.42.2
checking GTHREAD_CFLAGS... -pthread -I/usr/include/glib-2.0 -I/usr/lib64/glib-2.0/include  
checking GTHREAD_LIBS... -pthread -lgthread-2.0 -lglib-2.0  
checking for aarch64-redhat-linux-gnu-pkg-config... (cached) /usr/bin/pkg-config
checking pkg-config is at least version 0.9.0... yes
checking for libxfce4util-1.0 >= 4.8.0... 4.10.1
checking LIBXFCE4UTIL_CFLAGS... -I/usr/include/xfce4 -I/usr/include/glib-2.0 -I/usr/lib64/glib-2.0/include  
checking LIBXFCE4UTIL_LIBS... -lxfce4util -lglib-2.0  
checking for aarch64-redhat-linux-gnu-pkg-config... (cached) /usr/bin/pkg-config
checking pkg-config is at least version 0.9.0... yes
checking for libxfce4ui-1 >= 4.8.0... 4.10.0
checking LIBXFCE4UI_CFLAGS... -pthread -I/usr/include/xfce4/libxfce4ui-1 -I/usr/include/gtk-2.0 -I/usr/include/xfce4 -I/usr/lib64/gtk-2.0/include -I/usr/include/atk-1.0 -I/usr/include/cairo -I/usr/include/gdk-pixbuf-2.0 -I/usr/include/pango-1.0 -I/usr/include/glib-2.0 -I/usr/lib64/glib-2.0/include -I/usr/include/pixman-1 -I/usr/include/freetype2 -I/usr/include/libpng15 -I/usr/include/libdrm -I/usr/include/harfbuzz  
checking LIBXFCE4UI_LIBS... -lxfce4ui-1 -lgtk-x11-2.0 -lxfce4util -lgdk-x11-2.0 -latk-1.0 -lgio-2.0 -lpangoft2-1.0 -lpangocairo-1.0 -lgdk_pixbuf-2.0 -lcairo -lpango-1.0 -lfontconfig -lgobject-2.0 -lfreetype -lglib-2.0  
checking for aarch64-redhat-linux-gnu-pkg-config... (cached) /usr/bin/pkg-config
checking pkg-config is at least version 0.9.0... yes
checking for libxfce4panel-1.0 >= 4.8.0... 4.10.1
checking LIBXFCE4PANEL_CFLAGS... -pthread -I/usr/include/xfce4/libxfce4panel-1.0 -I/usr/include/gtk-2.0 -I/usr/include/glib-2.0 -I/usr/lib64/glib-2.0/include -I/usr/include/xfce4 -I/usr/lib64/gtk-2.0/include -I/usr/include/atk-1.0 -I/usr/include/cairo -I/usr/include/gdk-pixbuf-2.0 -I/usr/include/pango-1.0 -I/usr/include/pixman-1 -I/usr/include/freetype2 -I/usr/include/libpng15 -I/usr/include/libdrm -I/usr/include/harfbuzz  
checking LIBXFCE4PANEL_LIBS... -Wl,--export-dynamic -pthread -lxfce4panel-1.0 -lgtk-x11-2.0 -lgmodule-2.0 -lxfce4util -lgdk-x11-2.0 -latk-1.0 -lgio-2.0 -lpangoft2-1.0 -lpangocairo-1.0 -lgdk_pixbuf-2.0 -lcairo -lpango-1.0 -lfontconfig -lgobject-2.0 -lfreetype -lglib-2.0  
checking whether to build with debugging support... minimum
configure: creating ./config.status
config.status: creating Makefile
config.status: creating panel-plugin/Makefile
config.status: creating icons/Makefile
config.status: creating icons/16x16/Makefile
config.status: creating icons/22x22/Makefile
config.status: creating icons/24x24/Makefile
config.status: creating icons/32x32/Makefile
config.status: creating icons/scalable/Makefile
config.status: creating po/Makefile.in
config.status: creating config.h
config.status: executing depfiles commands
config.status: executing libtool commands
config.status: executing default-1 commands
config.status: executing po/stamp-it commands
Build Configuration:
* Debug Support:    minimum
+ make -j8
make  all-recursive
make[1]: Entering directory `/builddir/build/BUILD/xfce4-battery-plugin-1.0.5'
Making all in panel-plugin
make[2]: Entering directory `/builddir/build/BUILD/xfce4-battery-plugin-1.0.5/panel-plugin'
/bin/sh ../libtool --tag=CC --mode=compile gcc -DHAVE_CONFIG_H -I. -I. -I.. -I.. -DG_LOG_DOMAIN=\"xfce4-battery-plugin\" -DPACKAGE_LOCALE_DIR=\"/usr/share/locale\"   -DNDEBUG -pthread -I/usr/include/xfce4/libxfce4panel-1.0 -I/usr/include/gtk-2.0 -I/usr/include/glib-2.0 -I/usr/lib64/glib-2.0/include -I/usr/include/xfce4 -I/usr/lib64/gtk-2.0/include -I/usr/include/atk-1.0 -I/usr/include/cairo -I/usr/include/gdk-pixbuf-2.0 -I/usr/include/pango-1.0 -I/usr/include/pixman-1 -I/usr/include/freetype2 -I/usr/include/libpng15 -I/usr/include/libdrm -I/usr/include/harfbuzz   -pthread -I/usr/include/xfce4/libxfce4ui-1 -I/usr/include/gtk-2.0 -I/usr/include/xfce4 -I/usr/lib64/gtk-2.0/include -I/usr/include/atk-1.0 -I/usr/include/cairo -I/usr/include/gdk-pixbuf-2.0 -I/usr/include/pango-1.0 -I/usr/include/glib-2.0 -I/usr/lib64/glib-2.0/include -I/usr/include/pixman-1 -I/usr/include/freetype2 -I/usr/include/libpng15 -I/usr/include/libdrm -I/usr/include/harfbuzz   -I/usr/include/xfce4 -I/usr/include/glib-2.0 -I/usr/lib64/glib-2.0/include   -pthread -I/usr/include/gtk-2.0 -I/usr/lib64/gtk-2.0/include -I/usr/include/atk-1.0 -I/usr/include/cairo -I/usr/include/gdk-pixbuf-2.0 -I/usr/include/pango-1.0 -I/usr/include/glib-2.0 -I/usr/lib64/glib-2.0/include -I/usr/include/pixman-1 -I/usr/include/freetype2 -I/usr/include/libpng15 -I/usr/include/libdrm -I/usr/include/harfbuzz    -O2 -g -pipe -Wall -Wp,-D_FORTIFY_SOURCE=2 -fexceptions -fstack-protector-strong --param=ssp-buffer-size=4 -grecord-gcc-switches   -c -o libbattery_la-battery.lo `test -f 'battery.c' || echo './'`battery.c
/bin/sh ../libtool --tag=CC --mode=compile gcc -DHAVE_CONFIG_H -I. -I. -I.. -I.. -DG_LOG_DOMAIN=\"xfce4-battery-plugin\" -DPACKAGE_LOCALE_DIR=\"/usr/share/locale\"   -DNDEBUG -pthread -I/usr/include/xfce4/libxfce4panel-1.0 -I/usr/include/gtk-2.0 -I/usr/include/glib-2.0 -I/usr/lib64/glib-2.0/include -I/usr/include/xfce4 -I/usr/lib64/gtk-2.0/include -I/usr/include/atk-1.0 -I/usr/include/cairo -I/usr/include/gdk-pixbuf-2.0 -I/usr/include/pango-1.0 -I/usr/include/pixman-1 -I/usr/include/freetype2 -I/usr/include/libpng15 -I/usr/include/libdrm -I/usr/include/harfbuzz   -pthread -I/usr/include/xfce4/libxfce4ui-1 -I/usr/include/gtk-2.0 -I/usr/include/xfce4 -I/usr/lib64/gtk-2.0/include -I/usr/include/atk-1.0 -I/usr/include/cairo -I/usr/include/gdk-pixbuf-2.0 -I/usr/include/pango-1.0 -I/usr/include/glib-2.0 -I/usr/lib64/glib-2.0/include -I/usr/include/pixman-1 -I/usr/include/freetype2 -I/usr/include/libpng15 -I/usr/include/libdrm -I/usr/include/harfbuzz   -I/usr/include/xfce4 -I/usr/include/glib-2.0 -I/usr/lib64/glib-2.0/include   -pthread -I/usr/include/gtk-2.0 -I/usr/lib64/gtk-2.0/include -I/usr/include/atk-1.0 -I/usr/include/cairo -I/usr/include/gdk-pixbuf-2.0 -I/usr/include/pango-1.0 -I/usr/include/glib-2.0 -I/usr/lib64/glib-2.0/include -I/usr/include/pixman-1 -I/usr/include/freetype2 -I/usr/include/libpng15 -I/usr/include/libdrm -I/usr/include/harfbuzz    -O2 -g -pipe -Wall -Wp,-D_FORTIFY_SOURCE=2 -fexceptions -fstack-protector-strong --param=ssp-buffer-size=4 -grecord-gcc-switches   -c -o libbattery_la-libacpi.lo `test -f 'libacpi.c' || echo './'`libacpi.c
/bin/sh ../libtool --tag=CC --mode=compile gcc -DHAVE_CONFIG_H -I. -I. -I.. -I.. -DG_LOG_DOMAIN=\"xfce4-battery-plugin\" -DPACKAGE_LOCALE_DIR=\"/usr/share/locale\"   -DNDEBUG -pthread -I/usr/include/xfce4/libxfce4panel-1.0 -I/usr/include/gtk-2.0 -I/usr/include/glib-2.0 -I/usr/lib64/glib-2.0/include -I/usr/include/xfce4 -I/usr/lib64/gtk-2.0/include -I/usr/include/atk-1.0 -I/usr/include/cairo -I/usr/include/gdk-pixbuf-2.0 -I/usr/include/pango-1.0 -I/usr/include/pixman-1 -I/usr/include/freetype2 -I/usr/include/libpng15 -I/usr/include/libdrm -I/usr/include/harfbuzz   -pthread -I/usr/include/xfce4/libxfce4ui-1 -I/usr/include/gtk-2.0 -I/usr/include/xfce4 -I/usr/lib64/gtk-2.0/include -I/usr/include/atk-1.0 -I/usr/include/cairo -I/usr/include/gdk-pixbuf-2.0 -I/usr/include/pango-1.0 -I/usr/include/glib-2.0 -I/usr/lib64/glib-2.0/include -I/usr/include/pixman-1 -I/usr/include/freetype2 -I/usr/include/libpng15 -I/usr/include/libdrm -I/usr/include/harfbuzz   -I/usr/include/xfce4 -I/usr/include/glib-2.0 -I/usr/lib64/glib-2.0/include   -pthread -I/usr/include/gtk-2.0 -I/usr/lib64/gtk-2.0/include -I/usr/include/atk-1.0 -I/usr/include/cairo -I/usr/include/gdk-pixbuf-2.0 -I/usr/include/pango-1.0 -I/usr/include/glib-2.0 -I/usr/lib64/glib-2.0/include -I/usr/include/pixman-1 -I/usr/include/freetype2 -I/usr/include/libpng15 -I/usr/include/libdrm -I/usr/include/harfbuzz    -O2 -g -pipe -Wall -Wp,-D_FORTIFY_SOURCE=2 -fexceptions -fstack-protector-strong --param=ssp-buffer-size=4 -grecord-gcc-switches   -c -o libbattery_la-libapm.lo `test -f 'libapm.c' || echo './'`libapm.c
LC_ALL=C /usr/bin/intltool-merge  -d -u -c ../po/.intltool-merge-cache ../po battery.desktop.in battery.desktop
libtool: compile:  gcc -DHAVE_CONFIG_H -I. -I. -I.. -I.. -DG_LOG_DOMAIN=\"xfce4-battery-plugin\" -DPACKAGE_LOCALE_DIR=\"/usr/share/locale\" -DNDEBUG -pthread -I/usr/include/xfce4/libxfce4panel-1.0 -I/usr/include/gtk-2.0 -I/usr/include/glib-2.0 -I/usr/lib64/glib-2.0/include -I/usr/include/xfce4 -I/usr/lib64/gtk-2.0/include -I/usr/include/atk-1.0 -I/usr/include/cairo -I/usr/include/gdk-pixbuf-2.0 -I/usr/include/pango-1.0 -I/usr/include/pixman-1 -I/usr/include/freetype2 -I/usr/include/libpng15 -I/usr/include/libdrm -I/usr/include/harfbuzz -pthread -I/usr/include/xfce4/libxfce4ui-1 -I/usr/include/gtk-2.0 -I/usr/include/xfce4 -I/usr/lib64/gtk-2.0/include -I/usr/include/atk-1.0 -I/usr/include/cairo -I/usr/include/gdk-pixbuf-2.0 -I/usr/include/pango-1.0 -I/usr/include/glib-2.0 -I/usr/lib64/glib-2.0/include -I/usr/include/pixman-1 -I/usr/include/freetype2 -I/usr/include/libpng15 -I/usr/include/libdrm -I/usr/include/harfbuzz -I/usr/include/xfce4 -I/usr/include/glib-2.0 -I/usr/lib64/glib-2.0/include -pthread -I/usr/include/gtk-2.0 -I/usr/lib64/gtk-2.0/include -I/usr/include/atk-1.0 -I/usr/include/cairo -I/usr/include/gdk-pixbuf-2.0 -I/usr/include/pango-1.0 -I/usr/include/glib-2.0 -I/usr/lib64/glib-2.0/include -I/usr/include/pixman-1 -I/usr/include/freetype2 -I/usr/include/libpng15 -I/usr/include/libdrm -I/usr/include/harfbuzz -O2 -g -pipe -Wall -Wp,-D_FORTIFY_SOURCE=2 -fexceptions -fstack-protector-strong --param=ssp-buffer-size=4 -grecord-gcc-switches -c libacpi.c  -fPIC -DPIC -o .libs/libbattery_la-libacpi.o
libtool: compile:  gcc -DHAVE_CONFIG_H -I. -I. -I.. -I.. -DG_LOG_DOMAIN=\"xfce4-battery-plugin\" -DPACKAGE_LOCALE_DIR=\"/usr/share/locale\" -DNDEBUG -pthread -I/usr/include/xfce4/libxfce4panel-1.0 -I/usr/include/gtk-2.0 -I/usr/include/glib-2.0 -I/usr/lib64/glib-2.0/include -I/usr/include/xfce4 -I/usr/lib64/gtk-2.0/include -I/usr/include/atk-1.0 -I/usr/include/cairo -I/usr/include/gdk-pixbuf-2.0 -I/usr/include/pango-1.0 -I/usr/include/pixman-1 -I/usr/include/freetype2 -I/usr/include/libpng15 -I/usr/include/libdrm -I/usr/include/harfbuzz -pthread -I/usr/include/xfce4/libxfce4ui-1 -I/usr/include/gtk-2.0 -I/usr/include/xfce4 -I/usr/lib64/gtk-2.0/include -I/usr/include/atk-1.0 -I/usr/include/cairo -I/usr/include/gdk-pixbuf-2.0 -I/usr/include/pango-1.0 -I/usr/include/glib-2.0 -I/usr/lib64/glib-2.0/include -I/usr/include/pixman-1 -I/usr/include/freetype2 -I/usr/include/libpng15 -I/usr/include/libdrm -I/usr/include/harfbuzz -I/usr/include/xfce4 -I/usr/include/glib-2.0 -I/usr/lib64/glib-2.0/include -pthread -I/usr/include/gtk-2.0 -I/usr/lib64/gtk-2.0/include -I/usr/include/atk-1.0 -I/usr/include/cairo -I/usr/include/gdk-pixbuf-2.0 -I/usr/include/pango-1.0 -I/usr/include/glib-2.0 -I/usr/lib64/glib-2.0/include -I/usr/include/pixman-1 -I/usr/include/freetype2 -I/usr/include/libpng15 -I/usr/include/libdrm -I/usr/include/harfbuzz -O2 -g -pipe -Wall -Wp,-D_FORTIFY_SOURCE=2 -fexceptions -fstack-protector-strong --param=ssp-buffer-size=4 -grecord-gcc-switches -c battery.c  -fPIC -DPIC -o .libs/libbattery_la-battery.o
libtool: compile:  gcc -DHAVE_CONFIG_H -I. -I. -I.. -I.. -DG_LOG_DOMAIN=\"xfce4-battery-plugin\" -DPACKAGE_LOCALE_DIR=\"/usr/share/locale\" -DNDEBUG -pthread -I/usr/include/xfce4/libxfce4panel-1.0 -I/usr/include/gtk-2.0 -I/usr/include/glib-2.0 -I/usr/lib64/glib-2.0/include -I/usr/include/xfce4 -I/usr/lib64/gtk-2.0/include -I/usr/include/atk-1.0 -I/usr/include/cairo -I/usr/include/gdk-pixbuf-2.0 -I/usr/include/pango-1.0 -I/usr/include/pixman-1 -I/usr/include/freetype2 -I/usr/include/libpng15 -I/usr/include/libdrm -I/usr/include/harfbuzz -pthread -I/usr/include/xfce4/libxfce4ui-1 -I/usr/include/gtk-2.0 -I/usr/include/xfce4 -I/usr/lib64/gtk-2.0/include -I/usr/include/atk-1.0 -I/usr/include/cairo -I/usr/include/gdk-pixbuf-2.0 -I/usr/include/pango-1.0 -I/usr/include/glib-2.0 -I/usr/lib64/glib-2.0/include -I/usr/include/pixman-1 -I/usr/include/freetype2 -I/usr/include/libpng15 -I/usr/include/libdrm -I/usr/include/harfbuzz -I/usr/include/xfce4 -I/usr/include/glib-2.0 -I/usr/lib64/glib-2.0/include -pthread -I/usr/include/gtk-2.0 -I/usr/lib64/gtk-2.0/include -I/usr/include/atk-1.0 -I/usr/include/cairo -I/usr/include/gdk-pixbuf-2.0 -I/usr/include/pango-1.0 -I/usr/include/glib-2.0 -I/usr/lib64/glib-2.0/include -I/usr/include/pixman-1 -I/usr/include/freetype2 -I/usr/include/libpng15 -I/usr/include/libdrm -I/usr/include/harfbuzz -O2 -g -pipe -Wall -Wp,-D_FORTIFY_SOURCE=2 -fexceptions -fstack-protector-strong --param=ssp-buffer-size=4 -grecord-gcc-switches -c libapm.c  -fPIC -DPIC -o .libs/libbattery_la-libapm.o
libacpi.c: In function 'read_acad_state_sysfs':
libacpi.c:400:8: warning: unused variable 'name' [-Wunused-variable]
  char *name;
        ^
libacpi.c:399:17: warning: unused variable 'propety' [-Wunused-variable]
  struct dirent *propety;
                 ^
libacpi.c: In function 'read_acad_state':
libacpi.c:459:5: warning: implicit declaration of function 'access' [-Wimplicit-function-declaration]
     if (access(acpath,R_OK)){
     ^
libacpi.c:459:23: error: 'R_OK' undeclared (first use in this function)
     if (access(acpath,R_OK)){
                       ^
libacpi.c:459:23: note: each undeclared identifier is reported only once for each function it appears in
libapm.c: In function 'apm_read':
libapm.c:67:10: warning: ignoring return value of 'fgets', declared with attribute warn_unused_result [-Wunused-result]
     fgets(buffer, sizeof(buffer) - 1, str);
          ^
libapm.c:103:7: warning: ignoring return value of 'fgets', declared with attribute warn_unused_result [-Wunused-result]
  fgets(buffer, sizeof(buffer) - 1, str);
       ^
libapm.c:107:11: warning: ignoring return value of 'fgets', declared with attribute warn_unused_result [-Wunused-result]
      fgets(buffer, sizeof(buffer) - 1, str);
           ^
libapm.c:108:11: warning: ignoring return value of 'fgets', declared with attribute warn_unused_result [-Wunused-result]
      fgets(buffer, sizeof(buffer) - 1, str);
           ^
libapm.c:118:8: warning: ignoring return value of 'fgets', declared with attribute warn_unused_result [-Wunused-result]
   fgets(buffer, sizeof(buffer) - 1, str);
        ^
libapm.c:128:8: warning: ignoring return value of 'fgets', declared with attribute warn_unused_result [-Wunused-result]
   fgets(buffer, sizeof(buffer) - 1, str);
        ^
libapm.c:133:12: warning: ignoring return value of 'fgets', declared with attribute warn_unused_result [-Wunused-result]
       fgets(buffer, sizeof(buffer) - 1, str);
            ^
libapm.c:136:12: warning: ignoring return value of 'fgets', declared with attribute warn_unused_result [-Wunused-result]
       fgets(buffer, sizeof(buffer) - 1, str);
            ^
libacpi.c: In function 'check_acpi_sysfs':
libacpi.c:223:8: warning: ignoring return value of 'fgets', declared with attribute warn_unused_result [-Wunused-result]
   fgets(tmptype, 8, typefile);
        ^
libacpi.c: In function 'read_sysfs_int':
libacpi.c:375:8: warning: ignoring return value of 'fscanf', declared with attribute warn_unused_result [-Wunused-result]
  fscanf(f,"%d",&out);
        ^
libacpi.c: In function 'read_sysfs_string':
libacpi.c:391:8: warning: ignoring return value of 'fscanf', declared with attribute warn_unused_result [-Wunused-result]
  fscanf(f,"%s",buf2);
        ^
libacpi.c: In function 'read_acad_state':
libacpi.c:470:9: warning: ignoring return value of 'fread', declared with attribute warn_unused_result [-Wunused-result]
   fread (buf, 512, 1, acpi);
         ^
libacpi.c: In function 'read_acpi_info':
libacpi.c:618:9: warning: ignoring return value of 'fread', declared with attribute warn_unused_result [-Wunused-result]
   fread (buf, 1,512, acpi);
         ^
libacpi.c: In function 'read_acpi_state':
libacpi.c:857:9: warning: ignoring return value of 'fread', declared with attribute warn_unused_result [-Wunused-result]
   fread (buf, 512, 1, acpi);
         ^
libacpi.c: In function 'get_fan_status':
libacpi.c:1036:10: warning: ignoring return value of 'fgets', declared with attribute warn_unused_result [-Wunused-result]
     fgets(line,255,fp);
          ^
libacpi.c:1044:10: warning: ignoring return value of 'fgets', declared with attribute warn_unused_result [-Wunused-result]
     fgets(line,255,fp);
          ^
libacpi.c: In function 'get_temperature':
libacpi.c:1061:10: warning: ignoring return value of 'fgets', declared with attribute warn_unused_result [-Wunused-result]
     fgets(line,255,fp);
          ^
libacpi.c:1073:10: warning: ignoring return value of 'fgets', declared with attribute warn_unused_result [-Wunused-result]
     fgets(line,255,fp);
          ^
make[2]: *** [libbattery_la-libacpi.lo] Error 1
make[2]: *** Waiting for unfinished jobs....
Generating and caching the translation database
Merging translations into battery.desktop.
battery.c: In function 'setup_battmon':
battery.c:662:16: warning: unused variable 'icon' [-Wunused-variable]
     GdkPixbuf *icon;
                ^
make[2]: Leaving directory `/builddir/build/BUILD/xfce4-battery-plugin-1.0.5/panel-plugin'
make[1]: *** [all-recursive] Error 1
make[1]: Leaving directory `/builddir/build/BUILD/xfce4-battery-plugin-1.0.5'
make: *** [all] Error 2
error: Bad exit status from /var/tmp/rpm-tmp.a0e7Wy (%build)
    Bad exit status from /var/tmp/rpm-tmp.a0e7Wy (%build)
RPM build errors:
Child return code was: 1
EXCEPTION: Command failed. See logs for output.
 # bash --login -c /usr/bin/rpmbuild -bb --target aarch64 --nodeps  /builddir/build/SPECS/xfce4-battery-plugin.spec 
Traceback (most recent call last):
  File "/usr/lib/python2.7/site-packages/mockbuild/trace_decorator.py", line 84, in trace
    result = func(*args, **kw)
  File "/usr/lib/python2.7/site-packages/mockbuild/util.py", line 520, in do
    raise exception.Error("Command failed. See logs for output.\n # %s" % (command,), child.returncode)
Error: Command failed. See logs for output.
 # bash --login -c /usr/bin/rpmbuild -bb --target aarch64 --nodeps  /builddir/build/SPECS/xfce4-battery-plugin.spec 
LEAVE do --> EXCEPTION RAISED



More information about the CentOS-build-reports mailing list